program: Gaussian 09
title: 000131546
version: EM64L-G09RevD.01
frameworkgroup: C1[X(C11H13NO2S)]
method: RPBEPBE
basis: SDD
operation: Freq
keyword: #p
keyword: freq=noraman
keyword: PBEPBE/SDD
title: #p freq=noraman PBEPBE/SDD
converged: YES YES NO NO
title: Mulliken charges:
elementType: S O O N C C C C C C C C C C C H H H H H H H H H H H H H
charge: 0.208306 -0.399677 -0.284164 -0.138418 0.506503 -0.388216 -0.364680 -0.233121 -0.165178 -0.250572 -0.260159 -0.350753 0.235519 -0.866578 -0.604081 0.229460 0.270332 0.240008 0.230625 0.230136 0.253633 0.220720 0.242645 0.278086 0.268905 0.265832 0.262006 0.362879
chargesum: 0.00000
title: Mulliken charges with hydrogens summed into heavy atoms:
elementType: S O O N C C C C C C C C C C C
charge: 0.208306 -0.036797 -0.284164 -0.138418 0.506503 -0.388216 -0.135220 0.037210 0.074830 -0.019947 -0.030024 -0.097120 0.235519 -0.069834 0.137370
polarizability: 2.69416261e+02 8.48079003e-01 1.82329829e+02 1.72386376e+00 -6.46552166e-01 7.14581438e+01
1716.lowfreq: -5.9430 -3.6791 -2.0265 0.0016 0.0022 0.0029 17.0370 37.9656 59.8688
frequency: 16.9041 37.9356 59.8676 60.6380 98.3760 120.4725 142.0286 164.1195 173.5177 210.7074 219.6754 228.6648 240.8405 294.9250 306.6243 335.2780 362.6193 395.3457 436.8001 451.6037 516.8921 534.9024 561.6395 601.0301 659.3355 661.9454 677.6188 735.0264 760.0167 778.9313 855.0066 862.3346 893.4145 942.8888 951.5763 965.6895 982.1812 989.2180 1007.2671 1028.7672 1051.5061 1068.8774 1117.7115 1120.3530 1132.2485 1179.0222 1214.5298 1256.1189 1286.8585 1299.5214 1314.6929 1348.9493 1361.8132 1377.3847 1406.2646 1429.0428 1453.1020 1455.8149 1468.5925 1469.0378 1482.8229 1553.4305 1566.2800 1596.6199 1636.0833 2981.5452 3007.6825 3066.7691 3099.2796 3121.3788 3125.8510 3130.8018 3134.4200 3141.9957 3158.6359 3167.6245 3170.7965 3472.4560
redmass: 6.5148 3.6456 3.7737 4.8479 3.6386 2.2761 2.4719 2.2483 3.1225 3.7640 3.0076 4.4317 1.1798 3.4582 4.3159 1.4040 2.6418 8.1917 4.4925 3.2449 3.6771 4.7938 6.7762 6.1270 6.4794 5.1911 7.5217 2.6253 1.5190 6.4359 3.0981 1.5685 2.0728 1.6490 2.2432 1.1854 1.3371 1.2838 1.1592 6.0455 2.6711 2.9183 1.5023 1.8323 1.7610 1.0738 1.5119 1.7822 1.7505 1.4218 1.3329 1.1426 3.0890 3.8440 1.2782 2.1602 1.4446 1.1837 1.1316 1.1817 1.1239 8.5918 6.1748 5.9262 5.7196 1.0339 1.0290 1.1027 1.0892 1.0984 1.1060 1.0852 1.1018 1.0899 1.0941 1.0909 1.0989 1.0685
irintensity: 2.3527 4.6613 1.1593 1.0288 2.5406 0.4402 0.2314 2.1306 2.3015 3.4178 6.9299 9.3770 0.4026 5.0604 0.8447 152.5572 47.3687 4.5967 12.0816 10.1343 1.9534 8.5171 10.7401 8.4745 10.1914 4.0526 12.7547 12.6795 74.6159 5.5679 4.0983 2.4914 11.0855 2.2454 5.1041 5.6534 1.6134 10.3354 50.6817 44.6793 10.9220 37.3282 44.7425 25.2568 138.8435 4.1708 22.9034 7.0817 15.1319 37.5622 13.9849 1.8129 75.8110 169.3889 87.1630 23.6408 45.4251 20.8419 7.2777 29.6372 21.8091 152.2114 24.7914 14.7545 142.0176 75.9206 29.5851 34.1004 0.3771 2.1691 17.0047 0.4279 7.4713 8.8813 21.0292 4.3476 33.4796 9.6163
temp: 298.150 k
press: 1.00000 atm
elementType: 16 8 8 7 6 6 6 6 6 6 6 6 6 6 6 1 1 1 1 1 1 1 1 1 1 1 1 1
symmnumber: 1
zpe: 566722.1 jmol-1
zpe.correction: 0.215853 hartree
zpe.thermalcorrener: 0.232059 hartree
zpe.thermalcorrenthalpy: 0.233003 hartree
zpe.thermalcorrgfe: 0.170216 hartree
zpe.sumelectzpe: -1029.056591 hartree
zpe.sumelectthermal: -1029.040385 hartree
zpe.sumelectthermalent: -1029.039441 hartree
zpe.sumelectthermalfe: -1029.102228 hartree
dipole: 1.2215 3.1001 -0.8109
dipole: 3.4293
quadrupole: -62.5654 -90.9783 -101.4414
quadrupole: -10.9110 3.7430 -4.1974
quadrupole: 22.4297 -5.9833 -16.4464 -10.9110 3.7430 -4.1974
hfenergy: -1029.2724436 hartree
pointgroup: C01 [X(C11H13N1O2S1)]
dipole: 0.7235929 -1.1351091 0.0908456 debye
polarizability: 266.038226|17.0143469|181.6392888|0.3426074|21.1081443|75.526719 unknown
InChI: InChI=1S/C11H13NO2S/c1-12(14)11(13)8-7-9-5-3-4-6-10(9)15-2/h3-8,14H,1-2H3
charge 0 multiplicity 1
28 atoms
S  1.780175 2.507857 0.315298
O  -3.731983 -1.889133 -0.772222
O  -2.954915 1.358336 0.625979
N  -3.917244 -0.638959 -0.034576
C  1.060619 -0.199668 0.021065
C  2.160129 0.723985 0.077606
C  1.359475 -1.57616 -0.19955
C  -0.322253 0.261469 0.209512
C  3.487351 0.258097 -0.08096
C  2.678667 -2.035425 -0.359605
C  3.747953 -1.111394 -0.296848
C  -1.461726 -0.444911 -0.066968
C  -2.785847 0.173394 0.188629
C  3.480194 3.251441 0.594627
C  -5.274193 -0.092201 -0.149033
H  0.533752 -2.295163 -0.221578
H  -0.473275 1.27412 0.611571
H  4.329294 0.955057 -0.044707
H  2.876401 -3.100038 -0.521986
H  4.782436 -1.452259 -0.415236
H  -1.447311 -1.441275 -0.516361
H  -5.995235 -0.713101 0.411848
H  -5.581931 -0.042445 -1.21008
H  -5.249686 0.922686 0.277284
H  3.98672 2.761761 1.440818
H  3.288998 4.307217 0.841284
H  4.09257 3.195177 -0.318687
H  -3.869537 -2.604366 -0.091222
