program: Gaussian 09
title: 000131543
version: EM64L-G09RevD.01
frameworkgroup: C1[X(C10H11N2O2)]
method: RPBEPBE
basis: SDD
operation: Freq
keyword: #p
keyword: freq=noraman
keyword: PBEPBE/SDD
title: #p freq=noraman PBEPBE/SDD
converged: NO YES NO NO
title: Mulliken charges:
elementType: O O N N C C C C C C C C C C H H H H H H H H H H H
charge: -0.266564 -0.149015 0.002625 0.148823 -0.342635 -0.486474 -0.667197 0.246011 0.381113 -0.241565 -0.322695 -0.315343 -0.298064 0.404295 0.227726 0.226914 0.272628 0.272067 0.215629 0.215445 0.244519 0.338818 0.308042 0.290999 0.293897
chargesum: 1.00000
title: Mulliken charges with hydrogens summed into heavy atoms:
elementType: O O N N C C C C C C C C C C
charge: -0.266564 -0.149015 0.002625 0.148823 0.112006 0.058221 0.008396 0.246011 0.381113 0.097253 -0.014653 -0.024344 -0.004167 0.404295
polarizability: 2.70394052e+02 6.38364740e+00 1.12009369e+02 -3.97772707e-01 -5.63943173e-02 6.19252901e+01
1716.lowfreq: -3.4779 0.0007 0.0009 0.0011 3.8875 10.2423 28.3978 45.2532 58.1687
frequency: 28.2440 44.7837 57.5991 71.8912 87.8614 132.7427 145.7177 207.9882 223.2020 245.9135 261.5336 319.1296 354.1503 392.8268 459.4220 468.5732 511.8171 536.1732 541.1205 609.7076 671.6525 685.8644 713.2361 735.3313 759.8154 814.1585 827.2737 857.9406 863.5902 899.7703 977.6932 979.7966 989.7386 992.5847 1055.4957 1102.1926 1111.8194 1129.4088 1168.8680 1195.9785 1216.6399 1254.4666 1286.4470 1287.1566 1304.3006 1353.8540 1363.3282 1403.0332 1419.0844 1459.0709 1471.1229 1473.8163 1480.6949 1484.9377 1510.4906 1596.1222 1735.6871 2089.9404 2981.8012 2985.8745 3007.9037 3023.7261 3057.9970 3085.5898 3094.9385 3172.4383 3173.7941 3192.0872 3210.7503
redmass: 5.6623 3.4134 2.1805 4.8732 3.2336 5.8653 6.9320 5.9907 1.0821 4.8859 7.0205 7.2943 3.4143 3.0314 8.4344 4.3018 2.7828 4.1905 7.8313 8.2328 7.6056 6.8302 3.8365 1.1807 7.3651 1.2595 6.3463 1.5939 1.3334 2.1226 1.3289 2.9341 3.2384 1.3146 2.8568 1.5463 2.2619 1.3403 1.7174 2.3921 1.3240 2.5558 1.2097 1.3228 1.3200 1.5514 3.6963 1.2035 1.0803 2.2588 5.3767 1.0517 1.0408 1.0827 6.6215 6.0516 10.8075 13.8580 1.0613 1.0372 1.0603 1.0967 1.1016 1.1022 1.0988 1.0933 1.0904 1.0993 1.0960
irintensity: 1.0698 1.2190 0.0182 0.1453 0.9191 4.0048 2.9239 0.3565 0.1072 25.4903 1.8919 0.2361 5.1180 0.0171 20.3418 4.5369 0.5955 17.2764 1.3799 45.4226 109.1619 24.0063 0.9338 16.2060 357.1463 0.7988 210.8300 101.9991 0.3191 198.6336 0.1030 120.8063 406.8136 0.5613 17.1246 1.9951 79.8593 20.0335 202.2795 1.8499 0.0905 358.2427 5.0660 8.2472 5.1759 21.9170 6.8764 8.0821 55.7711 74.4624 44.3082 3.4978 17.3819 17.8431 14.4509 472.7185 130.4766 527.3953 40.7618 22.9412 14.8979 0.0645 0.0821 53.2767 26.4116 3.0890 1.6762 5.1878 21.2467
temp: 298.150 k
press: 1.00000 atm
elementType: 8 8 7 7 6 6 6 6 6 6 6 6 6 6 1 1 1 1 1 1 1 1 1 1 1
symmnumber: 1
zpe: 504882.1 jmol-1
zpe.correction: 0.192299 hartree
zpe.thermalcorrener: 0.206217 hartree
zpe.thermalcorrenthalpy: 0.207161 hartree
zpe.thermalcorrgfe: 0.149880 hartree
zpe.sumelectzpe: -646.302047 hartree
zpe.sumelectthermal: -646.288130 hartree
zpe.sumelectthermalent: -646.287185 hartree
zpe.sumelectthermalfe: -646.344466 hartree
dipole: -7.3406 1.5805 0.0012
dipole: 7.5089
quadrupole: -10.6010 -69.7856 -79.4351
quadrupole: 2.6718 -0.0709 -0.0352
quadrupole: 42.6729 -16.5117 -26.1612 2.6718 -0.0709 -0.0352
hfenergy: -646.4943461 hartree
pointgroup: C01 [X(C10H11N2O2)]
dipole: 2.8571417 -0.5938984 0.4597745 debye
dipolederiv: -3.3938171 0.3163926 -0.2870644 0.5354728 -0.3924886 0.1493728 -0.4342647 0.1435475 -0.2954141 -0.741867 -0.1254122 0.0729519 0.4464208 -0.6409087 0.2903991 -0.3124615 0.2761693 -0.416503 2.6717836 0.0971551 -0.003203 0.2164403 0.0657339 0.0899441 -0.0774408 0.087184 0.1323813 -1.3798367 -0.0444201 -0.00601 -0.1259212 0.0814351 -0.0043819 0.0436248 -0.0025448 0.0822374 0.1409339 -0.0329219 0.0211462 -0.1395901 0.0959794 0.032787 0.0954581 0.0364573 0.1283773 -0.4358519 -0.0790091 0.0399306 -0.2922848 -0.095326 0.1113006 0.1668209 0.1123925 0.0131442 -0.0811462 -0.0043202 0.0005931 0.0749684 0.0601342 0.0259193 -0.0497997 0.0240798 0.0816464 2.9039575 -0.0880882 0.1219903 -1.1944002 0.9649591 -0.5145825 0.8696257 -0.4862911 0.5864594 2.3317405 -0.0758662 0.1025823 0.4181589 0.2923887 -0.0547481 -0.2293434 -0.0660949 0.2342134 -0.8071326 -0.1731227 0.0983422 -0.5044657 -0.1578116 0.0268686 0.319114 0.0347605 -0.1142098 -0.8859669 0.2026584 -0.1537257 0.3987875 -0.0613063 -0.0287732 -0.2846633 -0.0335823 -0.1041821 0.7956172 0.0678198 -0.0241542 -0.3187307 0.0398164 -0.0689455 0.2342261 -0.0592201 -0.0056875 0.7004525 -0.0437286 0.0480717 0.4079675 0.04499 -0.060108 -0.2529847 -0.0713924 -0.019309 -1.4722258 -0.0486099 -0.0061362 -0.0940975 0.1118222 -0.0354313 0.0225959 -0.0343526 0.0857773 0.0320031 -0.0024859 0.0478216 0.0207817 0.0809611 0.0121643 0.0269983 0.0254485 -0.1262249 0.0308495 -0.0423462 -0.0171996 -0.0139281 -0.1070211 -0.0595038 -0.0304646 -0.0737001 0.058673 0.0587563 0.0162209 0.0112624 0.1414735 -0.0025948 -0.0461553 -0.0062659 -0.0632785 0.1107881 0.0600146 -0.0040285 -0.0185846 0.0675435 0.1338065 -0.0003147 -0.1232482 0.014173 -0.0292255 0.0894597 0.0158795 0.0246443 -0.0528424 -0.1280684 -0.0793306 0.0164929 -0.0888707 0.0582839 0.0897607 -0.015763 -0.0216183 -0.0370399 0.0891035 0.0096646 0.0440439 0.0202883 -0.1591379 -0.1166089 0.0696037 -0.0474419 0.0915492 0.0420331 0.0476293 -0.0613422 0.0474912 0.0839113 0.192492 0.0190184 -0.0125906 -0.0216567 0.141533 0.0261604 0.0148287 0.027285 0.1638872 0.0955006 -0.0263325 0.0154978 -0.0154215 0.1159765 0.0397672 0.0083312 0.0394652 0.1500507 0.0630179 -0.0267832 0.0150076 -0.0037932 0.1084644 0.0458826 -0.0003274 0.0454174 0.1470265 0.0581134 0.02849 -0.0221136 -0.0053922 0.1163885 0.0444149 0.0004459 0.0451679 0.1530366 unknown
polarizability: 270.5645895|1.7843951|96.4336577|3.854215|-22.9660843|77.3304636 unknown
InChI: InChI=1S/C10H11N2O2/c1-2-3-10(13)14-9-6-4-8(12-11)5-7-9/h4-7H,2-3H2,1H3
charge 1 multiplicity 1
25 atoms
O  -1.089931 -0.474296 0.328634
O  -1.917818 1.379861 -0.933458
N  4.414697 0.066827 0.104533
N  5.572314 0.161297 0.073383
C  -4.716867 0.553565 -0.410548
C  -3.496767 -0.23656 0.11311
C  -6.039086 -0.11986 0.010364
C  -2.185036 0.380997 -0.269767
C  0.259845 -0.244447 0.207211
C  0.869863 0.843394 -0.503922
C  1.067409 -1.220433 0.878306
C  2.26048 0.946747 -0.537722
C  2.455088 -1.132494 0.854674
C  3.050218 -0.03895 0.140047
H  -4.66245 0.628137 -1.512464
H  -4.678472 1.588924 -0.023869
H  -3.503745 -1.280417 -0.262586
H  -3.52105 -0.329605 1.217903
H  -6.119332 -1.145748 -0.394247
H  -6.132592 -0.178925 1.110554
H  -6.902152 0.454923 -0.36672
H  0.254993 1.584776 -1.014863
H  0.566513 -2.034626 1.408328
H  2.741417 1.769722 -1.075172
H  3.07716 -1.87371 1.364491
