program: Gaussian 09
title: 000131541
version: EM64L-G09RevD.01
frameworkgroup: C1[X(C12H11Cl2NO4)]
method: RPBEPBE
basis: SDD
operation: Freq
keyword: #p
keyword: freq=noraman
keyword: PBEPBE/SDD
title: #p freq=noraman PBEPBE/SDD
converged: YES YES NO NO
title: Mulliken charges:
elementType: Cl Cl O O O O N C C C C C C C C C C C C H H H H H H H H H H H
charge: -0.060476 -0.056186 -0.402462 -0.231969 -0.410440 -0.231927 -0.472516 -0.199182 -0.498325 -0.141481 0.524186 0.282266 -0.530929 -0.348761 0.136903 -0.425088 0.182663 -0.310680 -0.072630 0.291485 0.270533 0.238756 0.263804 0.264804 0.290136 0.335617 0.256796 0.281808 0.393864 0.379431
chargesum: 0.00000
title: Mulliken charges with hydrogens summed into heavy atoms:
elementType: Cl Cl O O O O N C C C C C C C C C C C C
charge: -0.060476 -0.056186 -0.008598 -0.231969 -0.031009 -0.231927 -0.136899 0.092303 0.010964 0.122323 0.524186 0.282266 0.024012 -0.348761 0.136903 -0.168292 0.182663 -0.028873 -0.072630
polarizability: 2.24878897e+02 -3.41232910e+00 1.81768776e+02 -5.98733154e+00 1.02724315e+01 9.84367941e+01
1716.lowfreq: -6.5168 -5.1520 -0.0015 -0.0011 -0.0008 6.8853 26.9177 33.8566 49.5304
frequency: 26.9056 33.8489 49.5261 51.9897 62.0195 107.5009 138.1453 150.2944 157.0613 172.3529 187.8611 209.9408 220.1609 266.3503 292.4434 328.6673 369.5771 381.4649 404.4687 449.4550 462.9302 477.6511 497.9039 531.8088 539.2816 553.9237 571.4499 573.3864 583.3708 613.3120 643.3002 661.3970 681.4067 711.3990 725.4780 793.2012 813.3838 845.3985 862.0435 880.6949 904.6602 918.5179 932.8215 982.8107 1041.0983 1052.6723 1066.6713 1096.0295 1098.7553 1149.4130 1175.4059 1189.9411 1198.2120 1221.1266 1240.9330 1258.8057 1280.5644 1285.6507 1309.8728 1317.3178 1335.4457 1350.6805 1362.9537 1371.2803 1411.6968 1439.1823 1468.1752 1477.9610 1493.8468 1567.0373 1611.1849 1654.6192 1662.6760 2914.5048 3001.7075 3019.4486 3030.0167 3055.9228 3106.8792 3159.7529 3198.0756 3508.3125 3521.4539 3532.0698
redmass: 8.6600 9.9603 8.7597 11.3172 12.0842 8.6973 6.1557 7.1545 3.2009 15.7264 7.7760 5.8045 5.2036 4.8325 6.4555 5.6937 3.8655 7.3213 5.8268 3.7935 3.6485 1.5085 1.7887 4.3723 4.1284 2.7945 4.4736 3.6224 3.8612 1.7620 1.4375 4.3610 3.6485 3.6051 4.9719 6.1077 1.4260 1.5513 3.8988 3.4054 4.6384 3.8870 2.2508 3.1011 2.5182 2.5911 2.4203 2.1403 1.8275 3.2622 1.4257 1.5001 1.9686 1.4027 1.4074 1.4093 2.1009 1.7725 1.4828 1.3560 1.8721 1.5587 1.7505 3.6202 3.1443 1.0933 2.5840 1.1803 3.0179 5.6264 8.3424 8.7691 8.2675 1.0802 1.0620 1.0748 1.0740 1.0970 1.0996 1.0925 1.0937 1.0640 1.0643 1.0770
irintensity: 0.0350 0.3741 0.7063 1.0231 0.1881 0.7826 1.1115 0.1658 1.0225 0.3537 2.4756 2.3415 0.4947 4.6965 2.3108 0.8069 13.4269 12.8607 18.5673 5.0408 41.8158 45.4133 32.8989 41.1722 9.4869 23.0380 8.9920 11.6218 21.2532 97.7168 105.8490 22.0803 65.6044 21.0662 18.9167 47.3761 23.6984 42.1663 0.4501 0.8402 22.7446 30.8197 24.8327 26.8336 227.6804 249.5546 172.2274 43.0384 7.9296 8.0882 10.4689 4.6892 2.8002 13.0505 5.1815 1.5724 8.7102 35.2215 42.7358 21.8120 40.7348 14.4366 65.3975 24.1439 10.6392 28.1682 36.9942 53.4642 157.1504 121.9119 339.2409 207.9622 203.8260 54.6449 9.3181 1.9039 12.9034 5.9123 8.8043 1.6489 3.2364 24.2423 51.0070 96.0228
temp: 298.150 k
press: 1.00000 atm
elementType: 17 17 8 8 8 8 7 6 6 6 6 6 6 6 6 6 6 6 6 1 1 1 1 1 1 1 1 1 1 1
symmnumber: 1
zpe: 562597.3 jmol-1
zpe.correction: 0.214282 hartree
zpe.thermalcorrener: 0.232268 hartree
zpe.thermalcorrenthalpy: 0.233212 hartree
zpe.thermalcorrgfe: 0.166113 hartree
zpe.sumelectzpe: -1738.285650 hartree
zpe.sumelectthermal: -1738.267664 hartree
zpe.sumelectthermalent: -1738.266720 hartree
zpe.sumelectthermalfe: -1738.333819 hartree
dipole: 3.8655 1.3910 1.2997
dipole: 4.3089
quadrupole: -120.4494 -123.2929 -126.8420
quadrupole: 6.3088 4.4526 -3.3463
quadrupole: 3.0787 0.2352 -3.3139 6.3088 4.4526 -3.3463
hfenergy: -1738.4999321 hartree
pointgroup: C01 [X(C12H11Cl2N1O4)]
dipole: -1.5363905 -0.494719 0.5182772 debye
polarizability: 224.6188293|-4.138954|181.1804344|6.6677823|-13.1441652|99.2852033 unknown
InChI: InChI=1S/C12H11Cl2NO4/c13-6-3-7(14)11-5(2-10(16)17)1-9(12(18)19)15-8(11)4-6/h3-5,9,15-16,18H,1-2H2
charge 0 multiplicity 1
30 atoms
Cl 1.617373 3.071929 -0.934701
Cl 5.247958 -0.858939 0.49899
O  -3.39645 -2.495332 -0.313001
O  -1.53605 -3.884409 -0.18952
O  -3.10778 2.807514 1.585171
O  -3.063045 2.444592 -0.706588
N  0.12502 -1.790258 0.396361
C  -0.599162 0.883492 -0.495923
C  -1.453561 -0.356647 -0.861969
C  -1.286028 -1.460126 0.215349
C  0.846189 0.472742 -0.227762
C  1.147385 -0.866777 0.192895
C  -1.173064 1.679713 0.708551
C  1.938971 1.347154 -0.394065
C  -2.040714 -2.741696 -0.121818
C  2.498682 -1.266018 0.409322
C  -2.515559 2.320258 0.411186
C  3.285759 0.995899 -0.183613
C  3.524804 -0.334068 0.215576
H  -0.618116 1.564752 -1.366683
H  -2.515158 -0.079617 -0.955238
H  -1.118149 -0.754258 -1.837273
H  -1.737973 -1.087061 1.16282
H  -1.265678 1.059273 1.618558
H  -0.47539 2.496266 0.977646
H  0.353218 -2.77964 0.516607
H  2.729027 -2.286728 0.728949
H  4.096324 1.711886 -0.325984
H  -3.87235 -3.347675 -0.50694
H  -3.968884 3.253979 1.358097
