program: Gaussian 09
title: 000131532
version: EM64L-G09RevD.01
frameworkgroup: C1[X(C22H28Cl2N2O6)]
method: RPBEPBE
basis: SDD
operation: Freq
keyword: #p
keyword: freq=noraman
keyword: PBEPBE/SDD
title: #p freq=noraman PBEPBE/SDD
converged: YES YES NO NO
title: Mulliken charges:
elementType: Cl Cl O O O O O O N N C C C C C C C C C C C C C C C C C C C C C C H H H H H H H H H H H H H H H H H H H H H H H H H H H H
charge: -0.006663 -0.032753 -0.289145 -0.315382 -0.283688 -0.247983 -0.278074 -0.302042 -0.460920 -0.596221 -0.388440 0.094115 0.144230 0.185065 0.202657 0.691362 -0.385771 0.119663 -0.778146 0.094210 -0.363254 -0.388249 -0.080671 -0.236153 -0.253887 -0.294287 -0.241233 -0.212205 -0.500387 -0.678317 -0.195211 -0.402347 0.305386 0.368949 0.260810 0.240594 0.261678 0.264806 0.217114 0.241472 0.228635 0.219477 0.206506 0.257066 0.190093 0.213312 0.229840 0.228994 0.236876 0.234383 0.236226 0.225473 0.219753 0.216556 0.185073 0.211512 0.221545 0.198116 0.270752 0.289131
chargesum: 0.00000
title: Mulliken charges with hydrogens summed into heavy atoms:
elementType: Cl Cl O O O O O O N N C C C C C C C C C C C C C C C C C C C C C C
charge: -0.006663 -0.032753 -0.289145 -0.315382 -0.283688 -0.247983 -0.278074 -0.302042 -0.091971 -0.036338 -0.083054 0.094115 0.144230 0.185065 0.202657 0.691362 0.115633 0.119663 -0.034548 0.094210 -0.363254 -0.146776 -0.080671 -0.007518 0.003179 0.131697 0.162172 0.246629 0.207097 -0.016535 0.201374 0.017314
polarizability: 3.73254740e+02 -1.48397349e+00 3.07179896e+02 -3.10471964e+00 7.19511912e+00 2.43671414e+02
1716.lowfreq: -4.9605 -3.6679 -0.0020 -0.0018 -0.0007 4.2101 9.9889 18.7777 26.0005
frequency: 9.7056 18.7063 25.9763 27.9435 35.1458 37.2442 44.4084 48.5013 53.6312 66.4370 70.0672 74.1622 80.7278 91.7995 96.4832 98.1439 101.3083 114.0894 125.6337 128.3915 144.2162 147.9650 155.8009 160.3074 184.3315 197.0940 200.1333 206.1788 217.3768 224.5040 246.6085 255.4871 265.7633 268.3298 291.3198 312.5922 313.7073 326.7204 341.4991 355.5460 357.0437 364.3091 377.2604 399.6976 434.3331 441.6168 452.5564 482.0881 505.7109 530.5094 542.3124 557.6091 573.4246 589.1652 598.5943 639.6926 655.1411 666.8251 706.4312 711.6902 717.0009 738.6449 747.4740 775.6290 785.2931 798.0663 799.1635 804.3840 811.3812 815.4180 838.2862 845.5077 858.0662 895.0434 914.7807 958.9003 964.6415 978.7279 988.5915 991.7592 1002.3925 1014.3134 1016.5933 1026.8314 1037.9968 1042.0770 1047.6992 1063.1991 1080.6911 1083.6449 1091.6568 1109.8774 1111.9633 1113.8512 1117.7624 1131.4938 1135.9553 1145.4193 1150.7522 1156.5401 1175.8338 1201.7083 1211.2701 1219.8415 1222.8470 1246.0458 1247.3526 1251.8384 1260.4163 1288.6624 1290.5772 1303.3549 1312.8063 1323.7288 1325.0226 1328.9301 1362.0241 1365.5315 1370.8550 1380.3611 1397.8960 1406.9076 1410.0729 1412.4457 1421.2529 1432.4370 1432.9941 1443.6958 1453.0021 1458.8913 1463.1322 1463.7965 1464.1803 1464.5016 1474.4444 1477.5341 1487.1154 1487.8812 1489.6922 1562.7723 1581.7870 1588.2106 1592.4026 1617.8991 1642.6252 1645.6353 2916.0059 2928.8091 2938.0808 2956.4666 2991.9576 2993.6948 2998.8766 2999.3176 2999.8111 3009.8544 3017.5867 3026.1799 3055.8282 3059.0889 3065.8945 3087.7064 3088.9973 3091.5535 3097.6283 3101.4183 3107.0778 3135.1998 3144.9689 3154.2316 3173.9560 3402.0606 3491.9970 3620.5999
redmass: 6.3170 4.1609 5.3640 3.6980 4.4497 4.8969 4.5609 5.0513 2.2526 3.3486 3.5345 3.5295 3.0830 3.1070 3.5829 2.7498 1.6827 1.4630 2.9039 3.6042 3.7880 7.6104 3.3675 3.9309 1.1190 4.4225 7.2142 7.3706 3.7542 4.7468 1.3926 3.6203 3.7160 3.1988 3.6409 4.3510 3.7446 10.2981 3.8698 6.1405 6.5547 3.9614 4.2811 5.2736 6.6797 8.2557 4.7671 5.0714 3.9072 4.9457 3.2048 2.7956 1.5738 5.7608 5.5359 5.6272 6.5573 5.8342 6.7098 6.8943 4.0770 4.1445 4.1301 2.8898 4.0007 1.2798 2.0269 1.4453 1.7067 1.3181 2.7480 5.0323 3.9159 1.4682 6.5967 1.6018 1.3528 2.4565 2.4594 4.2067 3.0392 4.8623 2.2468 2.6817 1.6617 2.6279 7.4648 2.6216 4.5707 3.7015 2.2281 2.2198 2.4103 1.2657 2.4337 3.4680 1.4665 1.7706 1.8447 1.2903 1.5140 1.1138 2.1313 1.1858 1.7931 1.2406 2.6516 1.4100 1.2147 2.4833 1.1114 1.7065 2.5037 1.3859 1.8523 1.3145 1.5739 1.3476 4.0696 1.4481 1.2731 1.2206 2.3249 1.4820 1.2074 1.4462 1.5069 1.0546 1.0514 1.0864 1.0957 1.1120 1.1026 1.0413 1.0598 1.0803 1.1539 1.0863 1.9315 6.4124 7.2856 7.1720 10.0612 4.5632 8.6284 1.0941 1.0698 1.0586 1.0566 1.0582 1.0356 1.1029 1.0298 1.0859 1.0503 1.0582 1.1054 1.0599 1.0941 1.0839 1.1059 1.0972 1.0986 1.1056 1.1041 1.1029 1.1001 1.0861 1.1041 1.0931 1.0981 1.0785 1.0455 1.0987
irintensity: 0.0521 0.0957 0.3981 0.0170 0.2815 0.2469 2.2741 0.7726 1.3034 0.7595 1.3175 0.3913 1.1862 0.2902 1.4791 0.1059 0.2422 2.1269 3.9534 0.8988 3.7032 2.4949 10.4479 0.9845 52.2246 0.5231 2.9946 1.7340 4.7267 6.9053 0.6369 1.5742 3.0150 3.0921 3.7464 13.9033 4.9672 6.4388 18.8793 1.6246 1.3808 0.7153 9.9624 9.8849 2.5257 6.3510 1.6191 3.2472 0.4856 6.4230 11.3359 52.7616 219.2182 0.1704 6.8802 8.2780 3.3561 3.3132 35.3519 1.5565 10.0760 11.0875 4.3896 51.1982 20.1321 1.3516 5.0425 11.0779 13.6993 67.6498 10.6083 10.3659 5.0008 1.3574 3.5219 5.3630 0.6086 61.3989 40.1618 283.1464 109.4563 45.1193 7.9783 129.7631 15.2433 49.6812 170.2198 78.6859 142.8405 45.0961 13.0725 0.6832 12.2991 0.0968 15.3345 43.9274 5.3269 13.4540 90.0049 5.9852 10.0600 5.5822 438.1257 3.4920 3.2653 3.3583 23.7059 9.1934 6.1476 100.7314 2.4733 26.7191 26.1782 9.8464 10.6802 12.0046 1.6968 2.7081 0.9663 5.2281 26.8854 62.7792 51.8711 1.6736 47.1987 18.8637 25.6036 21.2164 12.4197 15.7100 23.6398 11.8480 30.1865 13.3543 18.4870 8.8339 66.1881 8.7412 443.5540 14.6674 278.7108 5.6058 105.7860 20.9311 268.6703 38.6459 128.5683 43.3252 90.5678 42.1410 24.2461 63.4503 47.6381 30.8286 14.2111 20.9609 72.6153 10.7681 38.4164 4.3171 3.8589 6.4128 36.1228 5.2374 27.3763 48.1917 9.8547 4.5830 11.2893 10.0461 8.3488 327.4918 1.2610 3.8595
temp: 298.150 k
press: 1.00000 atm
elementType: 17 17 8 8 8 8 8 8 7 7 6 6 6 6 6 6 6 6 6 6 6 6 6 6 6 6 6 6 6 6 6 6 1 1 1 1 1 1 1 1 1 1 1 1 1 1 1 1 1 1 1 1 1 1 1 1 1 1 1 1
symmnumber: 1
zpe: 1235590.1 jmol-1
zpe.correction: 0.470611 hartree
zpe.thermalcorrener: 0.506185 hartree
zpe.thermalcorrenthalpy: 0.507130 hartree
zpe.thermalcorrgfe: 0.397772 hartree
zpe.sumelectzpe: -2333.646901 hartree
zpe.sumelectthermal: -2333.611327 hartree
zpe.sumelectthermalent: -2333.610383 hartree
zpe.sumelectthermalfe: -2333.719741 hartree
dipole: -7.9781 2.1658 2.0470
dipole: 8.5166
quadrupole: -195.4618 -184.1352 -195.0171
quadrupole: 0.7276 -5.1894 1.6085
quadrupole: -3.9237 7.4029 -3.4791 0.7276 -5.1894 1.6085
hfenergy: -2334.1175127 hartree
pointgroup: C01 [X(C22H28Cl2N2O6)]
dipole: -3.2736091 -0.471372 0.5369242 debye
polarizability: 350.9019324|37.7116015|260.53773|-15.7791452|-23.0968871|312.666388 unknown
InChI: InChI=1S/C22H28Cl2N2O6/c1-4-32-22(28)19-16(12-31-11-10-30-9-8-25)26-13(2)17(21(27)29-3)18(19)14-6-5-7-15(23)20(14)24/h5-7,18,26H,4,8-12,25H2,1-3H3
charge 0 multiplicity 1
60 atoms
Cl 4.141018 1.301553 -1.410015
Cl 4.292448 4.438555 -0.678332
O  -3.463414 -1.174719 -0.897545
O  -0.602323 -0.319885 -3.778829
O  3.546443 -0.760941 1.012663
O  1.60179 0.307161 -3.340862
O  2.396617 -1.82024 2.740313
O  -4.086939 -0.754365 1.915262
N  -1.141015 -1.204491 0.318401
N  -4.750947 -1.909063 5.409903
C  1.3972 -0.170251 -0.538242
C  0.207492 -0.387509 -1.493652
C  1.204374 -0.967869 0.764378
C  -1.019325 -0.809915 -1.011316
C  -0.052642 -1.383808 1.175674
C  1.576903 1.337341 -0.234573
C  -2.325772 -0.965747 -1.802489
C  0.489915 -0.093865 -2.904659
C  -0.386551 -2.071074 2.480276
C  2.372788 -1.240782 1.6158
C  2.737537 2.081915 -0.573972
C  0.52297 2.023067 0.425458
C  2.817092 3.459608 -0.258577
C  0.605294 3.393565 0.737953
C  1.762014 4.124796 0.393533
C  -4.02082 0.079322 -0.356557
C  -4.92797 -0.292103 0.804664
C  -0.323748 -0.039285 -5.217964
C  4.794911 -0.975582 1.769661
C  -1.610669 -0.328674 -5.985567
C  -4.89818 -1.111051 3.092683
C  -3.957784 -1.570924 4.215877
H  2.316932 -0.510267 -1.04135
H  -2.087876 -1.4676 0.630558
H  -2.281007 -1.86441 -2.439233
H  -2.485313 -0.096676 -2.462775
H  0.093294 -3.063609 2.534216
H  0.009587 -1.506373 3.339229
H  -1.478703 -2.188613 2.584089
H  -0.373452 1.458423 0.702444
H  -0.220728 3.897735 1.250326
H  -3.209683 0.749301 -0.002435
H  -4.599951 0.600323 -1.146873
H  1.85403 5.189777 0.624525
H  -5.518936 0.597285 1.117253
H  -5.630768 -1.094138 0.492548
H  0.513994 -0.682932 -5.541925
H  0.000353 1.012769 -5.314561
H  5.577711 -0.524855 1.143371
H  4.973838 -2.05407 1.920493
H  4.738476 -0.480311 2.754039
H  -1.921519 -1.379711 -5.854446
H  -2.432801 0.324829 -5.644933
H  -1.450421 -0.147351 -7.064085
H  -5.611805 -1.922786 2.825223
H  -5.483592 -0.234113 3.439521
H  -3.276309 -0.738006 4.465609
H  -3.32602 -2.406783 3.837103
H  -5.24576 -2.803141 5.366456
H  -4.28028 -1.761439 6.304066
