program: Gaussian 09
title: 000131529
version: EM64L-G09RevD.01
frameworkgroup: C1[X(C15H12N2O4)]
method: RPBEPBE
basis: SDD
operation: Freq
keyword: #p
keyword: freq=noraman
keyword: PBEPBE/SDD
title: #p freq=noraman PBEPBE/SDD
converged: YES YES NO NO
title: Mulliken charges:
elementType: O O O O N N C C C C C C C C C C C C C C C H H H H H H H H H H H H
charge: -0.237603 -0.437771 -0.264484 -0.242426 0.003412 -0.429517 0.064214 0.074792 0.338192 0.256230 0.400421 -0.555795 -0.464406 0.329794 -0.350974 -0.490915 -0.325869 0.002447 -0.445017 0.221481 -0.776075 0.276672 0.338500 0.286378 0.266494 0.278471 0.239637 0.208481 0.347497 0.259847 0.257912 0.228755 0.341227
chargesum: 0.00000
title: Mulliken charges with hydrogens summed into heavy atoms:
elementType: O O O O N N C C C C C C C C C C C C C C C
charge: -0.237603 -0.096544 -0.264484 -0.242426 0.003412 -0.082020 0.064214 0.074792 0.338192 0.256230 0.400421 -0.279123 -0.125906 0.329794 -0.084479 -0.204537 -0.047398 0.002447 0.003101 0.221481 -0.029561
polarizability: 4.77831300e+02 1.86775799e+01 1.90671644e+02 6.04454500e+00 3.38401584e+00 8.59978487e+01
1716.lowfreq: -9.4227 -6.4696 -0.0004 0.0002 0.0005 3.1039 34.4024 42.3133 48.7880
frequency: 34.3783 42.2823 48.7852 54.1665 81.9436 88.2507 118.0089 124.7307 161.0193 200.5109 209.2887 244.4184 252.5408 284.9323 303.0082 332.6091 349.7970 384.7531 423.7189 426.2661 431.2171 463.7253 466.9904 474.0358 527.9050 546.6059 557.9353 597.8185 608.0986 621.5063 649.5676 696.1348 699.0017 741.3290 751.1364 760.6867 762.1245 809.3447 830.3016 837.0891 854.3948 873.5245 895.4472 915.1335 925.3177 933.9179 955.3073 966.0708 995.1707 998.4407 1042.2456 1102.8214 1122.6568 1150.0897 1159.0113 1179.2707 1194.6250 1209.5736 1217.4881 1246.2512 1261.2507 1290.6500 1311.3243 1324.5382 1361.1288 1370.6859 1389.9701 1400.4201 1423.5241 1450.2705 1455.5848 1465.3815 1468.8904 1474.3956 1490.1786 1534.7660 1561.8757 1590.4751 1605.3910 1618.3107 1648.7726 2971.5830 2999.4666 3056.4080 3094.9016 3110.0479 3150.3259 3153.4811 3173.8027 3183.0209 3201.8431 3373.4338 3556.6142
redmass: 5.0204 1.5064 2.5950 3.2101 5.1839 4.7081 5.2959 6.6743 5.1124 5.2298 5.9694 5.7025 5.2502 4.6568 6.9108 3.3355 4.2889 1.5906 6.1635 4.7894 4.1007 5.2530 3.4161 5.1053 5.8687 5.4919 9.8302 3.5024 4.7961 5.0791 6.4309 6.2276 7.1452 5.3292 5.1275 6.8422 2.9688 5.9394 1.3904 1.1268 1.7171 2.9965 1.4824 4.3492 1.3643 4.3423 1.7370 1.4616 2.3265 1.8987 1.6495 3.5613 2.4176 1.7422 1.1926 2.3080 2.1607 2.0857 2.1026 3.9208 1.5695 2.5687 1.5115 3.2926 1.3132 5.4594 1.2138 4.7357 4.1692 1.1377 3.0182 1.2143 1.2069 2.9582 2.6373 7.0150 6.8409 7.1554 5.6485 6.2680 8.5844 1.0661 1.0362 1.0969 1.0980 1.1008 1.0923 1.0884 1.0971 1.0929 1.0934 1.0760 1.0663
irintensity: 0.7990 1.3861 0.9354 6.2820 5.0105 2.2034 0.8475 4.8422 7.3014 3.1412 1.1884 4.5573 7.0530 22.0396 1.0295 36.9605 19.5421 160.4510 16.4520 28.3649 2.1534 1.6576 4.0024 27.2846 15.0615 2.2743 2.4890 0.8008 5.1776 21.3924 17.4617 1.0406 2.3068 0.2978 11.2518 1.1924 0.0399 10.4066 38.8522 80.8731 39.0828 8.6397 28.4186 3.2097 49.6054 59.6173 51.3200 15.8834 11.0307 20.7550 18.7143 5.3731 36.4032 39.5996 36.4498 2.2474 13.7506 3.7058 73.8433 32.8584 30.3380 1.5629 23.0886 181.8034 51.5902 20.6631 113.4412 24.9034 23.0476 60.6689 113.9039 34.3668 37.3559 112.1353 1077.4705 103.6625 154.6721 320.0720 42.7729 47.2582 10.8064 50.8594 8.6963 14.2734 9.3442 11.8665 3.2135 0.0585 3.1295 0.2885 7.0227 71.7761 14.2002
temp: 298.150 k
press: 1.00000 atm
elementType: 8 8 8 8 7 7 6 6 6 6 6 6 6 6 6 6 6 6 6 6 6 1 1 1 1 1 1 1 1 1 1 1 1
symmnumber: 1
zpe: 636756.9 jmol-1
zpe.correction: 0.242528 hartree
zpe.thermalcorrener: 0.260707 hartree
zpe.thermalcorrenthalpy: 0.261651 hartree
zpe.thermalcorrgfe: 0.194963 hartree
zpe.sumelectzpe: -987.718877 hartree
zpe.sumelectthermal: -987.700698 hartree
zpe.sumelectthermalent: -987.699754 hartree
zpe.sumelectthermalfe: -987.766441 hartree
dipole: -1.4574 0.4352 0.5916
dipole: 1.6320
quadrupole: -111.8766 -130.4166 -118.7799
quadrupole: -4.5037 -2.2868 -1.0146
quadrupole: 8.4811 -10.0589 1.5778 -4.5037 -2.2868 -1.0146
hfenergy: -987.9614044 hartree
pointgroup: C01 [X(C15H12N2O4)]
dipole: 0.569724 -0.1670173 0.2445125 debye
polarizability: 478.3542328|14.3977565|189.5992047|-4.825858|-8.5291789|86.5473555 unknown
InChI: InChI=1S/C15H12N2O4/c1-8(19)16-10-5-12-15(6-13(10)20)21-14-3-2-9(7-18)4-11(14)17-12/h2-6,16,18H,7H2,1H3
charge 0 multiplicity 1
33 atoms
O  0.940571 -1.850007 0.076801
O  6.645586 1.115079 0.5891
O  -3.841478 -2.28067 0.182375
O  -4.028621 2.648191 -0.175295
N  0.601831 1.00295 -0.147183
N  -4.242913 0.326338 -0.003805
C  1.8706 0.412361 -0.125002
C  -0.468874 0.18764 -0.063796
C  -0.344268 -1.28374 0.04973
C  2.056576 -1.000926 -0.011339
C  4.317949 0.671624 -0.189688
C  3.030039 1.233995 -0.209614
C  -1.793296 0.756556 -0.083745
C  -2.90372 -0.068371 0.000206
C  3.335351 -1.584901 0.020188
C  -1.433026 -2.120713 0.131702
C  4.460817 -0.744911 -0.068062
C  -2.773636 -1.566572 0.110935
C  5.55917 1.545325 -0.306162
C  -4.764754 1.623427 -0.084878
C  -6.285386 1.704963 -0.042187
H  2.872779 2.314955 -0.291437
H  -1.892943 1.839602 -0.165485
H  -1.316551 -3.203997 0.213384
H  3.431182 -2.670725 0.110525
H  5.46932 -1.169948 -0.039764
H  6.007549 1.459665 -1.311568
H  5.295059 2.610244 -0.140222
H  -4.879706 -0.484858 0.068357
H  -6.634708 2.330036 -0.880928
H  -6.593972 2.209573 0.890671
H  -6.781415 0.721227 -0.093383
H  6.332889 1.175287 1.527667
