program: Gaussian 09
title: 000131526
version: EM64L-G09RevD.01
frameworkgroup: C1[X(C12H18O2)]
method: RPBEPBE
basis: SDD
operation: Freq
keyword: #pfreq=noraman
keyword: PBEPBE/SDD
title: #p freq=noraman PBEPBE/SDD
converged: YES YES NO NO
title: Mulliken charges:
elementType: O O C C C C C C C C C C C C H H H H H H H H H H H H H H H H H H
charge: -0.437980 -0.265545 0.351790 -0.181482 -0.514756 -0.505921 -0.453655 -0.438733 0.231372 -0.465065 -0.464892 -0.749812 -0.326130 0.060765 0.211223 0.200194 0.233044 0.233374 0.206037 0.209775 0.231408 0.221045 0.200593 0.230126 0.211157 0.226977 0.234642 0.235226 0.227455 0.208752 0.260757 0.378258
chargesum: 0.00000
title: Mulliken charges with hydrogens summed into heavy atoms:
elementType: O O C C C C C C C C C C C C
charge: -0.059722 -0.265545 0.351790 0.029741 -0.081518 -0.066510 -0.012472 -0.017095 0.231372 -0.023782 -0.003272 -0.078379 -0.065374 0.060765
polarizability: 1.53914592e+02 4.42962372e+00 1.29308771e+02 -6.02606954e+00 -1.20451446e+00 1.05579976e+02
1716.lowfreq: 0.0005 0.0009 0.0009 5.1018 13.2915 15.9075 23.9652 55.1492 84.7297
frequency: 23.0446 55.1324 84.7041 170.7901 195.6774 202.1080 205.6424 221.2764 248.9681 282.1533 305.4655 325.2918 338.2181 406.5313 444.4595 486.2464 507.2047 551.5285 580.4355 609.9992 631.2251 653.6610 709.7614 731.5608 768.1169 802.5371 812.9137 845.4996 870.9698 900.8214 904.5558 936.8447 943.3335 964.2574 969.9495 1004.6014 1020.0381 1041.3107 1048.3814 1075.5135 1082.0773 1096.2402 1111.9298 1118.8812 1135.0913 1172.0579 1192.9024 1200.4650 1223.7456 1235.6082 1271.8769 1280.5396 1293.2716 1295.8309 1298.4270 1312.4967 1316.1070 1322.9989 1342.1058 1349.0214 1369.4139 1395.6222 1443.6932 1460.8709 1464.1451 1469.4715 1473.2792 1478.1920 1486.2415 1492.3627 1590.1834 1632.9330 2952.0797 2964.4122 2969.2894 2979.9503 2987.0654 2990.5913 3002.1232 3005.3890 3014.8947 3046.0347 3052.7498 3057.8782 3069.1148 3081.3254 3081.5920 3092.7803 3112.3011 3502.1412
redmass: 5.1396 3.3430 2.7368 2.8066 2.3314 1.9125 2.4743 1.8741 2.2415 2.0126 4.2060 2.9105 3.1196 3.0783 3.6007 3.4126 2.6144 2.8907 2.1266 4.0102 1.5296 2.9424 2.3781 4.1945 1.3977 2.0097 2.1345 1.9384 2.1825 1.7197 2.5128 1.6996 2.1933 1.7850 2.2501 2.5318 2.5426 1.7354 1.7307 1.4052 2.0645 3.0270 2.1354 1.8974 1.4043 1.5709 1.5654 1.4853 1.4044 1.3738 1.3577 1.2758 1.4515 1.4884 1.6650 1.3951 1.6016 1.4739 1.4151 1.7036 1.6353 1.2108 1.0961 1.0868 1.0778 1.0732 1.0792 1.0712 1.0866 1.0618 7.0584 7.1280 1.0646 1.0784 1.0676 1.0373 1.0649 1.0777 1.0780 1.0648 1.0659 1.1019 1.0978 1.0976 1.0983 1.0988 1.1003 1.0996 1.0900 1.0635
irintensity: 1.2900 0.4353 0.0217 1.2374 0.0969 0.3565 0.3392 0.3159 1.0608 1.0677 2.3513 0.8588 1.9591 2.6781 5.4462 4.0313 8.1856 13.5179 10.7625 10.7577 81.1770 28.7663 17.5662 20.4896 4.0768 2.6163 4.0950 6.6467 6.3497 12.2019 0.9072 9.3407 45.1690 2.2254 42.1745 19.1278 43.2079 3.6518 10.9244 13.3528 1.8781 23.2003 4.2683 158.0115 13.7139 1.1735 1.9962 5.7581 0.5470 0.9417 2.9934 2.1300 6.6025 21.6141 19.8408 0.5854 8.8650 8.3824 4.2233 3.0245 5.1804 23.6826 28.9738 14.3809 1.7112 13.0131 5.0309 11.7172 7.3538 2.8790 223.7958 59.7128 22.2574 18.2428 31.8019 29.4899 25.2563 26.3887 56.0196 80.0713 55.3313 23.3074 33.1618 20.4514 33.5859 47.0891 1.9482 63.4435 3.1306 34.5625
temp: 298.150 k
press: 1.00000 atm
elementType: 8 8 6 6 6 6 6 6 6 6 6 6 6 6 1 1 1 1 1 1 1 1 1 1 1 1 1 1 1 1 1 1
symmnumber: 1
zpe: 725239.2 jmol-1
zpe.correction: 0.276229 hartree
zpe.thermalcorrener: 0.289677 hartree
zpe.thermalcorrenthalpy: 0.290622 hartree
zpe.thermalcorrgfe: 0.236157 hartree
zpe.sumelectzpe: -617.427889 hartree
zpe.sumelectthermal: -617.414441 hartree
zpe.sumelectthermalent: -617.413496 hartree
zpe.sumelectthermalfe: -617.467961 hartree
dipole: 0.9705 -1.8535 -0.2964
dipole: 2.1131
quadrupole: -76.2898 -93.3203 -84.9733
quadrupole: -0.4591 -2.2751 -0.2993
quadrupole: 8.5714 -8.4592 -0.1122 -0.4591 -2.2751 -0.2993
hfenergy: -617.704118 hartree
pointgroup: C01 [X(C12H18O2)]
dipole: 0.4160826 0.7055085 0.1424746 debye
polarizability: 152.1030523|-5.6938957|129.9119888|9.5255763|-2.2186795|106.7882984 unknown
InChI: InChI=1S/C12H18O2/c1-9-5-4-6-10(11(13)14)12(9)7-2-3-8-12/h6,9,13H,2-5,7-8H2,1H3
charge 0 multiplicity 1
32 atoms
O  -2.283484 -1.101756 -0.639114
O  -1.119647 -3.052189 -0.277864
C  0.117391 0.618845 -0.089537
C  1.619292 1.045585 -0.30153
C  -0.451461 1.266994 1.23245
C  -0.788562 1.256769 -1.211017
C  -1.951565 1.524534 0.971761
C  -2.004453 1.952946 -0.51864
C  0.073864 -0.924637 0.017912
C  2.504323 0.497484 0.846394
C  2.487221 -1.048089 0.866008
C  2.190418 0.635899 -1.681829
C  1.15562 -1.634618 0.478539
C  -1.105087 -1.791871 -0.299808
H  1.632918 2.154451 -0.246309
H  0.066367 2.235173 1.396039
H  -0.271924 0.63944 2.123217
H  -1.121875 0.50474 -1.942353
H  -0.195483 2.006739 -1.767252
H  -2.365854 2.292497 1.650967
H  -2.528752 0.595851 1.116285
H  -2.960978 1.666955 -0.988526
H  -1.910457 3.053107 -0.600154
H  2.131978 0.884833 1.813068
H  3.543253 0.862455 0.734838
H  2.781343 -1.433478 1.863747
H  3.24996 -1.457954 0.168748
H  2.155647 -0.457893 -1.831981
H  1.627615 1.100754 -2.51005
H  3.245071 0.958665 -1.771421
H  1.050032 -2.726516 0.546576
H  -2.985933 -1.785714 -0.816564
