program: Gaussian 09
title: 000131525
version: EM64L-G09RevD.01
frameworkgroup: C1[X(C14H17NO2)]
method: RPBEPBE
basis: SDD
operation: Freq
keyword: #p
keyword: freq=noraman
keyword: PBEPBE/SDD
title: #p freq=noraman PBEPBE/SDD
converged: YES YES NO NO
title: Mulliken charges:
elementType: O O N C C C C C C C C C C C C C C H H H H H H H H H H H H H H H H H
charge: -0.305063 -0.298125 -0.193477 0.232487 -0.529355 0.219157 0.187981 0.061447 -0.354232 0.074970 -0.680398 -0.348326 -0.361483 -0.689095 -0.240320 -0.263186 -0.524556 0.261597 0.204415 0.194906 0.247062 0.246503 0.244665 0.262341 0.247198 0.281501 0.203177 0.221133 0.225057 0.227290 0.232939 0.220766 0.203555 0.287470
chargesum: 0.00000
title: Mulliken charges with hydrogens summed into heavy atoms:
elementType: O O N C C C C C C C C C C C C C C
charge: -0.305063 -0.298125 -0.193477 0.232487 -0.063343 0.219157 0.187981 0.061447 0.087735 0.074970 0.073112 -0.101128 -0.079982 -0.039728 -0.013031 -0.030247 0.187235
polarizability: 2.31412974e+02 7.97489111e+00 1.96698366e+02 7.96134044e+00 -8.17766032e+00 9.24184834e+01
1716.lowfreq: -9.7678 -0.0005 -0.0003 0.0003 1.1815 3.4692 36.2019 57.3461 65.3385
frequency: 36.1405 57.2866 65.3379 83.9706 96.8162 126.4508 144.7465 169.5319 187.9159 199.3347 225.6497 230.0650 278.0488 298.4497 327.5193 342.1266 352.9250 380.3477 416.6164 435.5782 448.2371 490.7355 504.3386 548.3899 589.4227 615.0450 659.9565 681.8430 703.1697 742.1036 762.9308 785.0891 795.2617 863.9009 867.1391 884.6440 892.2467 920.6534 963.9572 1000.6785 1013.7136 1037.7202 1050.1282 1084.7724 1091.1370 1102.2156 1112.3645 1114.9652 1130.1033 1132.4510 1158.3368 1177.5130 1205.8045 1230.0439 1277.2580 1284.2975 1291.5536 1293.0487 1304.9136 1342.1669 1391.0271 1397.4356 1403.4347 1416.5479 1442.0180 1451.0255 1460.1736 1464.5408 1468.9599 1474.4868 1477.3957 1482.0706 1490.2079 1495.4571 1508.1467 1526.3606 1547.4957 1592.8772 1620.0405 2971.5359 2974.0807 2979.7358 2988.2809 2997.5563 3038.4118 3063.6895 3066.5991 3076.5263 3079.8981 3084.5060 3130.0168 3132.2930 3147.6495 3163.4273 3165.7649 3175.9376
redmass: 3.2520 3.6043 4.1502 2.2603 2.0941 2.7854 1.6226 1.6857 3.1104 1.4203 1.2638 3.4018 3.2779 3.5365 5.3553 6.3108 3.7628 6.5387 3.3593 3.0837 4.0942 6.0314 5.2622 3.8769 5.0166 4.5273 4.9447 5.1576 4.7318 1.1975 1.5765 3.4773 2.8877 2.1866 1.5038 1.7412 3.5151 3.6006 1.3544 1.3287 4.4802 2.2005 3.0467 1.9767 2.1988 1.9710 1.2451 1.3235 1.7895 2.5173 1.4765 1.2031 1.9961 1.3894 1.3332 2.0475 3.5673 1.7107 1.6833 1.4071 1.2113 2.7604 4.5904 1.3497 1.2830 1.0824 2.3480 1.2682 1.9279 1.0833 1.0628 1.0700 1.0718 1.1444 1.1830 6.0503 6.4544 7.6786 6.5572 1.0349 1.0363 1.0633 1.0406 1.0656 1.0946 1.1014 1.0975 1.0994 1.1003 1.0966 1.1057 1.0860 1.0899 1.0957 1.0938 1.0966
irintensity: 0.1894 0.6374 2.1495 5.3972 1.2523 3.3237 0.8981 0.3689 0.9643 0.4539 0.2504 1.7880 0.2977 8.2867 2.0092 3.2438 5.7793 3.7323 0.6126 6.6873 2.2072 5.2198 1.2559 2.1652 9.2896 1.1536 11.9936 9.6155 6.0427 6.5462 83.2968 2.3885 1.2445 5.2022 0.5617 2.4628 20.9056 9.5905 1.7207 1.0122 60.6019 9.9933 1.1928 25.9485 19.1139 6.6974 14.8716 0.5719 48.1913 32.0191 8.1225 4.6976 68.5215 3.1556 2.1969 52.2527 31.0207 3.8825 39.6924 3.0844 10.6765 75.2987 4.2847 60.7518 7.6446 14.7447 28.5642 16.9187 35.6542 0.9058 23.2769 18.3103 35.6440 4.4500 19.2927 164.4347 45.7394 118.9610 45.1152 102.0459 49.3352 17.0252 50.4162 45.8661 1.9031 18.5102 13.8514 41.7415 50.5262 39.6762 8.6756 5.2602 6.1198 28.4971 1.4690 20.9225
temp: 298.150 k
press: 1.00000 atm
elementType: 8 8 7 6 6 6 6 6 6 6 6 6 6 6 6 6 6 1 1 1 1 1 1 1 1 1 1 1 1 1 1 1 1 1
symmnumber: 1
zpe: 735432.5 jmol-1
zpe.correction: 0.280111 hartree
zpe.thermalcorrener: 0.296756 hartree
zpe.thermalcorrenthalpy: 0.297701 hartree
zpe.thermalcorrgfe: 0.235837 hartree
zpe.sumelectzpe: -747.623474 hartree
zpe.sumelectthermal: -747.606829 hartree
zpe.sumelectthermalent: -747.605885 hartree
zpe.sumelectthermalfe: -747.667749 hartree
dipole: 1.3417 -5.4678 1.9143
dipole: 5.9466
quadrupole: -92.0420 -96.6563 -104.0381
quadrupole: 4.7668 1.4688 3.4044
quadrupole: 5.5368 0.9225 -6.4593 4.7668 1.4688 3.4044
hfenergy: -747.9035858 hartree
pointgroup: C01 [X(C14H17N1O2)]
dipole: 0.4385808 2.2198611 -0.5944981 debye
polarizability: 232.2023931|-5.8510449|196.74452|-6.5455435|-1.2559883|91.5829104 unknown
InChI: InChI=1S/C14H17NO2/c1-4-7-12-14(17-3)13(16)10-8-5-6-9-11(10)15(12)2/h5-6,8-9H,4,7H2,1-3H3
charge 0 multiplicity 1
34 atoms
O  2.044137 -1.7921 -0.191531
O  -0.671936 -2.7803 0.205418
N  0.076542 1.319798 -0.265413
C  1.134277 0.398948 -0.348228
C  2.558057 0.886906 -0.530532
C  -1.25779 0.875017 -0.150298
C  -1.527437 -0.525921 -0.027793
C  0.897575 -0.976031 -0.213831
C  3.275518 1.221561 0.810077
C  -0.438806 -1.530769 0.002521
C  0.317776 2.778094 -0.290057
C  -2.349883 1.795117 -0.149081
C  -2.871525 -0.969603 0.100466
C  4.732325 1.676173 0.584462
C  -3.668098 1.327809 -0.02917
C  -3.939005 -0.061786 0.097848
C  1.992056 -3.063312 -0.954564
H  3.116699 0.064073 -1.007191
H  2.606498 1.753225 -1.217876
H  2.718551 2.005801 1.361559
H  3.255606 0.315875 1.443992
H  -0.164374 3.255027 0.581576
H  -0.086228 3.232433 -1.213719
H  1.391066 2.989753 -0.237709
H  -2.179123 2.869326 -0.251712
H  -3.024325 -2.04924 0.203048
H  4.779566 2.591706 -0.035901
H  5.314252 0.889924 0.068758
H  5.235191 1.893024 1.544222
H  -4.49375 2.048269 -0.035524
H  -4.970871 -0.41519 0.192151
H  2.972945 -3.532061 -0.780443
H  1.856858 -2.85646 -2.034291
H  1.170058 -3.694185 -0.582735
