program: Gaussian 09
title: 000131514
version: EM64L-G09RevD.01
frameworkgroup: C1[X(C8H15NO2)]
method: RPBEPBE
basis: SDD
operation: Freq
keyword: #p
keyword: freq=noraman
keyword: PBEPBE/SDD
title: #p freq=noraman PBEPBE/SDD
converged: YES YES NO NO
title: Mulliken charges:
elementType: O O N C C C C C C C C H H H H H H H H H H H H H H H
charge: -0.412778 -0.234568 -0.337115 -0.056698 -0.189130 -0.474541 -0.426272 -0.415525 -0.361199 0.123800 -0.697771 0.226656 0.256751 0.221958 0.225222 0.195419 0.228579 0.192886 0.227426 0.284190 0.194137 0.211225 0.211656 0.211547 0.216020 0.378124
chargesum: 0.00000
title: Mulliken charges with hydrogens summed into heavy atoms:
elementType: O O N C C C C C C C C
charge: -0.034654 -0.234568 -0.052924 0.169959 0.067621 -0.027361 -0.002274 0.004787 0.044163 0.123800 -0.058547
polarizability: 1.12565619e+02 2.51610715e+00 1.02685203e+02 -3.36974255e+00 -7.73301149e-01 7.63975896e+01
1716.lowfreq: -15.1086 -2.5050 -0.0005 -0.0004 0.0008 10.3466 26.8054 48.0388 78.8247
frequency: 26.4587 48.0298 78.7186 86.5240 126.0964 169.2701 196.4942 240.2539 272.8145 298.0404 332.1137 391.6338 450.2447 516.8678 558.9937 590.6223 616.5285 678.0945 737.2858 744.0730 835.0009 846.8105 884.7108 902.0486 912.2754 947.6988 995.2909 1012.4843 1041.0238 1047.9808 1064.1949 1099.1099 1123.4410 1133.3723 1161.4734 1170.7781 1187.9534 1218.5289 1246.8060 1253.1823 1277.9033 1280.5219 1295.9204 1306.0212 1322.7465 1326.7949 1339.3446 1354.5050 1389.9458 1428.3701 1459.8159 1466.2717 1474.6572 1478.3244 1487.0239 1495.1076 1647.3771 2901.6286 2954.8808 2958.1552 2967.5387 2973.3664 2977.4364 3003.0014 3007.8975 3036.3015 3037.3708 3070.3248 3073.0412 3079.4653 3474.7064 3505.8533
redmass: 3.9868 7.4974 2.9115 1.7273 2.8939 3.4988 2.1834 1.1349 3.2891 3.3537 3.3078 3.8873 2.3490 1.9356 2.0399 2.8807 2.2344 3.0914 1.7876 1.2478 1.5547 3.1218 2.1362 1.7659 1.9650 2.2582 2.2943 1.3932 2.5024 2.8799 2.3997 2.1390 2.4064 1.5766 2.5262 1.7961 1.3962 1.3837 1.4573 1.2979 1.2098 1.2527 1.1492 1.2953 1.3218 1.6656 1.4604 1.6287 1.2125 1.3524 1.0940 1.0729 1.0653 1.0423 1.0777 1.0875 8.6281 1.0709 1.0824 1.0641 1.0637 1.0363 1.0772 1.0634 1.0976 1.0983 1.0941 1.1007 1.0994 1.1031 1.0750 1.0641
irintensity: 0.6388 1.3414 0.5394 0.0577 0.5586 0.1501 2.5879 0.1257 16.1059 1.3453 5.4646 18.4705 4.7197 95.4929 30.2580 19.6474 102.4705 39.4076 60.1582 3.2728 4.3901 11.4870 2.7389 2.1717 3.6382 2.3984 24.5551 35.3051 148.0825 64.9982 11.6842 2.2898 13.1693 6.0242 4.5407 7.5469 2.2047 1.1765 2.5965 12.3430 0.7562 3.1359 3.9655 0.6867 14.2142 15.2475 5.6719 2.9497 10.6682 13.5852 4.4880 2.1892 4.1499 12.5552 13.2308 4.0901 243.4166 99.4582 22.7421 1.9258 23.5288 35.5258 62.6405 24.0575 1.4400 1.9734 87.0887 76.1938 46.4847 42.7574 4.8862 16.8308
temp: 298.150 k
press: 1.00000 atm
elementType: 8 8 7 6 6 6 6 6 6 6 6 1 1 1 1 1 1 1 1 1 1 1 1 1 1 1
symmnumber: 1
zpe: 586738.1 jmol-1
zpe.correction: 0.223477 hartree
zpe.thermalcorrener: 0.235612 hartree
zpe.thermalcorrenthalpy: 0.236556 hartree
zpe.thermalcorrgfe: 0.183868 hartree
zpe.sumelectzpe: -518.160471 hartree
zpe.sumelectthermal: -518.148336 hartree
zpe.sumelectthermalent: -518.147392 hartree
zpe.sumelectthermalfe: -518.200080 hartree
dipole: -1.6247 -0.4681 -0.7215
dipole: 1.8383
quadrupole: -73.7957 -61.4625 -69.0671
quadrupole: -1.6668 1.1484 -0.7528
quadrupole: -5.6872 6.6459 -0.9587 -1.6668 1.1484 -0.7528
hfenergy: -518.383948 hartree
pointgroup: C01[X(C8H15N1O2)]
dipole: 0.6320621 -0.2183388 0.2755549 debye
dipolederiv: -0.4455727 0.2979826 -0.0196962 0.3190732 -1.144565 -0.1291492 -0.046913 -0.0778954 -0.3531101 -0.9697349 0.0767432 0.2131667 -0.1083536 -0.6211873 0.0413031 0.3382382 0.0119504 -0.385234 -0.3656017 0.0578643 -0.0973346 0.0428346 -0.5930513 -0.0280324 -0.1245717 0.0655638 -0.5902866 0.1660135 0.1093995 -0.0363395 -0.0258559 0.0530366 -0.0189229 0.0606233 0.0459109 0.1287392 -0.1355266 -0.4066693 -0.0162684 -0.215318 0.3195392 0.0449505 -0.0342174 0.1033846 0.2149514 -0.0754269 0.0087175 0.0107012 0.0732281 -0.0005255 -0.0142855 -0.0299035 -0.0852795 0.1472518 0.003988 -0.0017404 -0.0172636 0.0143804 0.0672123 -0.0482154 -0.031925 -0.0639398 0.1026065 0.140613 0.1639335 0.0762638 0.0844587 0.4038603 0.1106907 -0.0130756 0.1311248 0.455764 0.0294054 0.0199638 -0.0071288 0.0299683 0.1404358 -0.03911 0.0451655 -0.046002 0.1164473 1.2217835 -0.129916 -0.3795141 0.0135285 1.3561668 0.0015288 -0.4860734 -0.0247082 0.2706051 -0.0521607 0.0488305 0.0256747 0.0357701 0.0686275 -0.0200837 -0.0116541 -0.0150248 0.0703873 0.0289345 -0.0146412 0.0322082 -0.0020054 -0.002292 0.0623285 0.0341883 0.0617636 -0.1246156 0.0630235 0.0484372 0.0802191 0.0296704 -0.0601679 -0.0623722 0.0617406 -0.0972038 -0.0709761 0.0055082 -0.0412607 0.0790561 -0.0264096 0.0279037 0.0321221 0.1185952 0.0782299 -0.07397 0.0053461 -0.0614904 -0.0885348 -0.07656 0.0283914 -0.0428593 -0.117335 -0.0720055 -0.0577247 0.0141578 0.0042617 0.0088371 -0.0151642 0.0378558 0.0978492 0.0116987 0.0609218 -0.1462942 0.0583203 0.0018131 -0.0135601 -0.0074787 -0.1421247 -0.0397582 -0.0076026 -0.0236941 0.0627856 -0.0110622 -0.0157097 0.0635778 -0.0476883 0.0168584 0.0208709 0.0749089 -0.0972058 -0.2691121 0.0522746 0.0398943 -0.0075102 0.0497219 -0.2161698 0.006957 -0.0340691 0.0512795 0.042787 0.0540492 -0.0033569 0.003289 -0.0670054 0.1961168 -0.0890431 0.0867852 -0.1318459 0.299146 0.0217145 -0.0111814 0.0698419 -0.0003859 0.0451227 0.0771217 0.030019 0.058909 -0.1713443 0.0418345 -0.0129891 -0.0048785 -0.0283532 -0.1860119 -0.0496349 -0.0047456 -0.024509 0.0579762 0.0713548 -0.063982 0.0047737 0.0076913 -0.177169 -0.0297649 0.0246979 -0.0222712 0.0832725 0.0746628 0.0068504 0.0220035 -0.0110256 0.0471694 0.094687 0.0879317 0.0664424 -0.1447035 -0.1724876 -0.0013255 -0.1018846 -0.0236941 0.0853548 -0.0314644 -0.1381589 -0.0219151 0.0122825 0.1745891 -0.1204288 0.1003007 -0.0450275 0.2496126 0.0522867 0.1056524 0.0680192 0.322369 unknown
polarizability: 112.4020688|-2.6886398|102.7266146|-3.3864424|2.0957465|76.5197279 unknown
InChI: InChI=1S/C8H15NO2/c1-2-3-6-4-5-9-7(6)8(10)11/h6-7,9-10H,2-5H2,1H3
charge 0 multiplicity 1
26 atoms
O  -1.100569 -2.367101 -0.127443
O  -2.894932 -1.039378 0.515788
N  -1.672122 1.283221 -0.639174
C  0.372475 0.280597 0.243699
C  -0.933778 0.004816 -0.601077
C  0.401769 1.833048 0.334228
C  1.634234 -0.362599 -0.366757
C  -1.089363 2.222373 0.354239
C  2.910682 -0.128939 0.473285
C  -1.76006 -1.13432 -0.004769
C  4.153715 -0.812303 -0.136185
H  0.227297 -0.125252 1.266231
H  -0.641167 -0.319144 -1.621425
H  0.888066 2.251261 -0.567099
H  0.944055 2.193812 1.224797
H  1.785644 0.045836 -1.388353
H  1.466885 -1.452043 -0.480687
H  -1.505134 2.092019 1.381232
H  -1.25707 3.269933 0.046523
H  -2.691928 1.171494 -0.582409
H  2.745158 -0.510485 1.501967
H  3.098709 0.958923 0.569779
H  4.006362 -1.905997 -0.213688
H  4.356594 -0.429246 -1.154095
H  5.055662 -0.634755 0.477866
H  -1.673585 -3.086171 0.255024
