program: Gaussian 09
title: 000131510
version: EM64L-G09RevD.01
frameworkgroup: C1[X(C19H28N2O2S)]
method: RPBEPBE
basis: SDD
operation: Freq
keyword: #p
keyword: freq=noraman
keyword: PBEPBE/SDD
title: #p freq=noraman PBEPBE/SDD
converged: YES YES NO NO
title: Mulliken charges:
elementType: S O O N N C C C C C C C C C C C C C C C C C C C H H H H H H H H H H H H H H H H H H H H H H H H H H H H
charge: 0.146186 -0.420198 -0.236398 -0.162531 -0.287386 0.146039 0.077602 0.352677 0.400740 -0.116805 -0.589456 -0.670631 -0.752275 -0.731767 -0.731354 -0.749776 -0.696792 -0.696673 0.595873 -0.272133 -0.330484 0.295491 -0.605085 -0.591931 0.259644 0.259577 0.219405 0.219377 0.217999 0.211541 0.201752 0.261252 0.260805 0.211535 0.202040 0.220380 0.224994 0.225102 0.202057 0.217564 0.237560 0.203315 0.236983 0.217266 0.265937 0.337644 0.265382 0.269631 0.295154 0.259074 0.226449 0.197647
chargesum: 0.00000
title: Mulliken charges with hydrogens summed into heavy atoms:
elementType: S O O N N C C C C C C C C C C C C C C C C C C C
charge: 0.146186 -0.082553 -0.236398 -0.162531 0.007767 0.146039 0.077602 0.352677 0.400740 -0.116805 -0.329812 -0.411055 -0.095494 -0.057222 -0.056973 -0.079299 -0.039611 -0.039108 0.595873 -0.006196 -0.330484 0.295491 -0.070072 0.091239
polarizability: 4.24728709e+02 -1.00441895e+01 2.67081127e+02 1.99068290e+00 1.75724970e+00 1.56328178e+02
1716.lowfreq: -9.4590 -5.8308 -2.8781 -0.0003 0.0007 0.0022 14.8632 25.6221 31.2837
frequency: 9.5646 25.4107 31.1692 47.3647 58.9654 67.4863 72.2937 73.8218 107.4001 120.8303 136.5346 147.5667 152.8855 153.7623 159.3378 185.3130 201.8055 204.5281 212.7855 228.6307 240.8556 260.3194 284.6576 287.9220 305.2027 310.1545 333.8903 338.3048 339.1622 344.8300 351.1032 376.3982 378.3622 383.5584 396.1231 404.3044 432.3895 439.9472 451.2324 467.6173 493.3685 510.5947 529.7410 576.3810 583.8745 619.7691 635.0701 648.2217 676.9027 706.3695 712.1655 749.3945 769.5199 786.0560 802.9636 870.1786 888.0215 889.3319 891.7082 914.2555 922.1158 922.6332 928.9103 931.8651 948.3156 948.5196 950.7444 974.1418 1002.7950 1023.0206 1025.3791 1028.0943 1032.2318 1104.1148 1107.8715 1113.5807 1142.7125 1145.4840 1163.2019 1174.3024 1196.7728 1200.3553 1203.2957 1208.6055 1223.0035 1242.2327 1242.7864 1254.9445 1294.6024 1300.8684 1325.0615 1341.7308 1369.1847 1372.9685 1381.1592 1385.2146 1390.8251 1398.1939 1414.4058 1427.4462 1428.9502 1439.6944 1451.2445 1456.7151 1458.9996 1460.4095 1468.0270 1474.4416 1475.7860 1477.1076 1477.1983 1479.0794 1488.5575 1491.6331 1493.5735 1495.3900 1503.6843 1507.5797 1583.5893 1602.2994 1615.5415 1634.6541 2911.3215 2971.6862 2974.5740 2975.8067 2976.9359 2980.1330 2981.7415 2996.2392 3041.6598 3058.8243 3061.1664 3061.4751 3063.2692 3064.1295 3070.7642 3073.6804 3075.0166 3077.6188 3080.1578 3083.5890 3084.1659 3096.1772 3110.8952 3115.9827 3160.3519 3179.4287 3525.3866 3598.4629
redmass: 3.7044 4.8466 3.3441 3.5042 4.6441 3.4824 3.0092 3.5248 2.0238 3.2825 2.8027 2.1615 2.6602 1.0960 3.2102 1.4488 2.0717 1.2987 1.3390 3.4275 1.2004 1.9734 3.1305 2.0206 2.9922 2.5395 4.6761 1.5153 2.2922 1.6114 1.3121 2.5361 3.5914 4.1278 2.7627 2.1138 2.7965 3.3415 12.0610 4.4457 4.0366 2.9881 2.8482 4.4516 4.4358 4.0609 3.0893 6.7184 5.1181 7.4969 5.9612 4.9314 6.1186 3.5474 3.0937 4.4174 2.5776 1.6823 1.4402 1.7161 1.6374 1.3438 1.6921 1.6741 1.2732 1.2091 1.4417 3.5150 2.9577 1.4359 1.4119 1.3801 1.3819 3.1947 5.0455 1.3815 1.1876 1.5322 3.0300 1.8790 2.6721 2.8770 2.9422 3.0812 3.3404 1.7987 2.3946 2.1886 2.3330 1.4658 2.3781 2.6728 1.1861 1.2420 1.3867 2.8884 1.1636 1.2419 1.2360 1.8857 1.3797 2.6653 1.1585 1.0485 1.0520 1.0575 1.0635 1.0680 1.0557 1.1230 1.0585 1.0556 1.1297 1.0522 1.0609 1.0789 1.0627 1.0640 6.0531 5.7464 8.7878 8.1246 1.0520 1.0353 1.0359 1.0368 1.0354 1.0375 1.0362 1.0530 1.0801 1.0981 1.1000 1.1124 1.0977 1.0993 1.0998 1.0985 1.0991 1.1008 1.0864 1.0997 1.0993 1.1010 1.0978 1.0967 1.0900 1.0896 1.0776 1.0648
irintensity: 4.0100 0.6221 3.2317 2.4299 0.6523 0.6417 0.9599 8.8604 39.9724 7.2690 0.2698 1.1848 4.5268 6.8507 4.4774 2.2142 1.0002 0.8680 52.1678 7.7100 0.1100 0.1471 9.8140 42.6336 2.9649 0.0650 6.7226 5.8028 2.0825 18.2819 19.4408 3.3669 5.1522 10.1769 1.0171 14.3857 1.6966 7.5484 8.1647 1.4939 26.6711 0.3908 4.4620 8.8601 17.4195 0.4082 9.6395 20.8748 4.7876 10.6495 7.3685 0.5810 6.6580 6.9128 11.2644 6.7187 13.5394 4.3873 0.0264 0.3422 0.5204 4.0622 3.5075 4.3393 3.1696 0.7947 27.0171 8.0058 22.5254 0.8293 5.6068 0.3689 0.8593 125.2570 106.6281 17.9618 2.0214 117.2114 211.4715 27.1133 2.3132 7.9122 8.1045 23.6126 67.9241 15.5583 2.8221 38.6420 28.7441 5.8839 35.4552 170.5834 24.0135 15.5787 4.3619 20.4090 18.7299 37.4571 44.7392 57.7776 36.6431 113.0869 7.3337 0.1339 0.1282 10.6312 3.6695 1.5735 3.5800 0.9422 2.1860 2.1446 2.8675 10.9375 8.6466 31.1757 26.4896 17.5518 1.6346 69.2692 161.9550 29.5919 117.3837 18.7735 19.1448 47.7633 41.9991 60.6120 19.2352 67.3255 30.6195 3.8179 8.2397 20.1346 72.6204 9.1060 43.8359 115.8307 24.7187 0.8186 1.1991 44.2608 87.6299 25.1218 4.4647 16.5062 4.8930 7.1056 3.5498 116.7294
temp: 298.150 k
press: 1.00000 atm
elementType: 16 8 8 7 7 6 6 6 6 6 6 6 6 6 6 6 6 6 6 6 6 6 6 6 1 1 1 1 1 1 1 1 1 1 1 1 1 1 1 1 1 1 1 1 1 1 1 1 1 1 1 1
symmnumber: 1
zpe: 1136190.2 jmol-1
zpe.correction: 0.432752 hartree
zpe.thermalcorrener: 0.460291 hartree
zpe.thermalcorrenthalpy: 0.461235 hartree
zpe.thermalcorrgfe: 0.373843 hartree
zpe.sumelectzpe: -1396.954498 hartree
zpe.sumelectthermal: -1396.926958 hartree
zpe.sumelectthermalent: -1396.926014 hartree
zpe.sumelectthermalfe: -1397.013407 hartree
dipole: -0.2711 1.2425 0.6449
dipole: 1.4259
quadrupole: -112.7797 -155.2833 -154.9065
quadrupole: -27.2281 -2.0357 -2.7822
quadrupole: 28.2101 -14.2934 -13.9167 -27.2281 -2.0357 -2.7822
hfenergy: -1397.3872496 hartree
pointgroup: C01 [X(C19H28N2O2S1)]
dipole: 0.049639 -0.5295437 0.1783722 debye
polarizability: 419.1668435|-28.2925192|270.1126804|-13.8556203|15.7886731|158.8584903 unknown
InChI: InChI=1S/C19H28N2O2S/c1-18(2,3)13-8-12(9-14(16(13)22)19(4,5)6)10-15-17(23)21(20-7)11-24-15/h8-10,20,22H,11H2,1-7H3
charge 0 multiplicity 1
52 atoms
S  2.567241 -1.932995 -0.597012
O  -4.178295 -0.214609 0.058596
O  4.164917 1.715131 -0.403494
N  4.881644 -0.521741 -0.64865
N  6.240982 -0.199457 -0.634687
C  -2.550064 -2.529767 -0.435298
C  -3.182793 2.598873 0.353951
C  -1.960689 -1.103137 -0.275888
C  -2.267385 1.365371 0.102608
C  -2.791441 0.037807 -0.035377
C  -0.571264 -0.877714 -0.365714
C  -0.869723 1.511339 -0.00254
C  -1.444759 -3.587652 -0.703394
C  -3.535367 -2.569352 -1.644394
C  -3.290554 -2.950687 0.871645
C  -2.36117 3.91321 0.467387
C  -3.954398 2.454903 1.707526
C  -4.170492 2.808114 -0.841447
C  0.007341 0.4152 -0.229687
C  1.436527 0.703539 -0.307417
C  2.531779 -0.10643 -0.451625
C  3.904561 0.484731 -0.496866
C  4.470398 -1.932376 -0.662864
C  6.966655 -0.310793 0.638094
H  0.077469 -1.733907 -0.556547
H  -0.424019 2.504735 0.096483
H  -0.721167 -3.653328 0.130189
H  -0.887838 -3.381509 -1.636282
H  -1.920775 -4.579479 -0.810915
H  -3.012179 -2.301782 -2.581396
H  -3.942507 -3.592071 -1.758878
H  -4.375277 -1.872849 -1.499646
H  -4.116107 -2.260649 1.104306
H  -2.590376 -2.965598 1.7277
H  -3.707013 -3.968921 0.751325
H  -3.051868 4.758846 0.639883
H  -1.650623 3.883887 1.312972
H  -1.796299 4.127049 -0.457732
H  -4.622963 1.575624 1.771276
H  -4.577128 3.352014 1.881158
H  -3.236598 2.364406 2.542264
H  -4.839321 1.950573 -1.044431
H  -3.602251 2.989408 -1.771252
H  -4.81176 3.688372 -0.650117
H  1.716875 1.766142 -0.231988
H  -4.670288 0.625353 0.220428
H  4.780173 -2.433553 -1.596464
H  4.854093 -2.480826 0.21573
H  6.733837 -0.418614 -1.502992
H  6.492726 0.344311 1.388804
H  7.995333 0.055732 0.476947
H  7.0254 -1.343875 1.050727
