program: Gaussian 09
title: 000131509
version: EM64L-G09RevD.01
frameworkgroup: C1[X(C20H30N2O2S)]
method: RPBEPBE
basis: SDD
operation: Freq
keyword: #p
keyword: freq=noraman
keyword: PBEPBE/SDD
title: #p freq=noraman PBEPBE/SDD
converged: YES YES NO NO
title: Mulliken charges:
elementType: S O O N N C C C C C C C C C C C C C C C C C C C C H H H H H H H H H H H H H H H H H H H H H H H H H H H H H H
charge: 0.150671 -0.420311 -0.233884 -0.182425 -0.036124 0.146335 0.077450 0.352706 0.400541 -0.117288 -0.588306 -0.670164 -0.731239 -0.732159 -0.752551 -0.749450 -0.696643 -0.696525 0.594798 -0.273418 -0.329488 0.294871 -0.610923 -0.603321 -0.602316 0.259320 0.259628 0.260587 0.211539 0.202008 0.211449 0.201703 0.261477 0.219278 0.219375 0.218054 0.225457 0.224664 0.220276 0.201501 0.217886 0.237777 0.203292 0.236863 0.216796 0.266026 0.337657 0.270012 0.271406 0.252116 0.190890 0.234178 0.191240 0.253340 0.233369
chargesum: 0.00000
title: Mulliken charges with hydrogens summed into heavy atoms:
elementType: S O O N N C C C C C C C C C C C C C C C C C C C C
charge: 0.150671 -0.082655 -0.233884 -0.182425 -0.036124 0.146335 0.077450 0.352706 0.400541 -0.117288 -0.328986 -0.410537 -0.057105 -0.057530 -0.095843 -0.079053 -0.039479 -0.039575 0.594798 -0.007392 -0.329488 0.294871 -0.069505 0.073862 0.075632
polarizability: 4.43433520e+02 -1.12515380e+01 2.74344200e+02 -7.76749734e-01 2.19969340e+00 1.67628740e+02
1716.lowfreq: -16.1551 -5.9644 -0.0018 -0.0015 0.0014 3.4572 12.8839 23.6430 30.2176
frequency: -9.9324 23.0707 30.0108 46.2747 50.7196 65.8600 70.2581 76.0998 117.0042 120.1637 137.7240 152.4988 153.0657 155.7571 171.0972 180.7297 190.2399 201.5437 203.7728 207.6718 227.6161 241.4439 260.5139 281.8748 286.8721 297.7607 305.4226 310.2781 334.6175 338.0998 344.0666 349.4965 360.2872 376.6639 379.9923 395.9198 403.0041 431.7188 438.0125 451.9364 457.4347 459.6847 483.7316 506.7446 514.9035 565.5902 579.2566 619.8434 635.0758 648.3059 678.1794 705.6395 707.7335 747.8037 760.1420 786.1118 800.0835 828.0429 885.9499 889.2095 892.6330 914.6399 917.9415 922.1651 928.9004 929.5830 931.4145 947.7611 948.4484 950.3807 975.0216 1019.0706 1023.1344 1025.1943 1027.6142 1032.2872 1070.8763 1085.5679 1104.6458 1108.9886 1138.4529 1145.2896 1149.4229 1184.5494 1197.9412 1200.6598 1203.3255 1208.6290 1223.7121 1234.0571 1242.4703 1254.7865 1261.5819 1294.5870 1300.4645 1324.0636 1348.0461 1369.9506 1373.1203 1380.7006 1384.7500 1390.7030 1398.6371 1413.6919 1414.2080 1427.9169 1432.0059 1439.8694 1457.3058 1457.8771 1458.9885 1467.0509 1467.9094 1472.1406 1474.5043 1475.4129 1475.6284 1477.0866 1479.2974 1487.9562 1488.8522 1491.8390 1493.4408 1503.0986 1507.7466 1583.5427 1602.0703 1614.1531 1634.2417 2881.2521 2889.4085 2971.6773 2974.9584 2975.8730 2977.2942 2980.1602 2981.9453 2998.1005 3039.4170 3041.0126 3059.1946 3060.9185 3062.0174 3063.8394 3064.3703 3070.6156 3073.7826 3074.9671 3077.7188 3081.3229 3084.0799 3084.2331 3102.4745 3106.4751 3111.0006 3116.1374 3159.1120 3178.4907 3599.0115
redmass: 3.1172 4.2012 4.2835 3.8317 4.3744 3.7635 2.8008 4.0236 4.5208 3.7326 3.4875 2.7889 2.3507 1.1782 4.4908 1.5087 1.1470 1.8973 1.2541 1.0577 3.4965 1.2147 1.9287 3.0651 1.8856 3.5711 2.9659 2.5536 4.0192 1.1468 1.6707 1.2062 4.7016 2.5381 3.0723 2.7214 2.1311 2.8015 3.3191 8.1045 4.2087 5.0086 4.0866 3.3568 3.0962 3.8745 4.7861 4.0550 3.1088 6.6155 5.1627 8.4038 5.9336 5.1223 6.3988 3.5706 3.5307 4.4445 2.5096 1.6786 1.4352 1.7198 3.9767 1.7102 1.3175 1.6983 1.6724 1.2522 1.2081 1.4675 3.5399 1.5624 1.4367 1.4106 1.3789 1.3801 3.6706 1.2319 2.9638 2.3141 2.3183 1.5326 1.1347 2.0618 2.5574 2.8724 2.9376 3.0283 3.0880 4.1952 1.8160 2.1638 2.6470 2.3352 1.4507 2.3568 2.4853 1.1878 1.2467 1.3906 2.8569 1.1636 1.2405 1.1317 1.2370 2.5699 1.1569 2.6636 1.0484 1.0525 1.0517 1.0768 1.0639 1.0512 1.0670 1.0867 1.0565 1.0504 1.0561 1.0595 1.1339 1.0526 1.0560 1.0630 1.0636 6.0723 6.0100 9.1918 8.2787 1.0550 1.0549 1.0353 1.0358 1.0369 1.0353 1.0376 1.0362 1.0532 1.0760 1.0760 1.0980 1.1000 1.1115 1.0992 1.0978 1.0998 1.0985 1.0991 1.1008 1.0865 1.0997 1.0995 1.1007 1.1013 1.0977 1.0967 1.0900 1.0896 1.0649
irintensity: 3.0166 0.8580 0.0382 0.1734 1.2018 0.0542 0.0942 3.3798 0.9278 2.3672 0.8258 1.6826 9.5156 3.0841 2.9551 1.2226 1.4698 0.0725 0.7417 0.2093 2.7912 0.1083 0.1839 9.0377 52.6301 2.5542 3.3337 0.2067 3.8663 2.9839 21.1856 12.7584 4.1254 4.1688 2.8331 0.8784 10.0257 1.8533 9.4546 11.3502 22.0450 0.9334 2.3447 9.5486 2.1375 12.1904 6.5177 0.4251 8.9700 19.1976 4.6993 13.0681 3.9493 0.8944 6.0504 6.8395 13.4081 7.8494 15.2242 3.9622 0.0756 0.3620 16.5678 1.8317 2.2444 1.8351 5.4632 2.1999 0.2302 28.4377 8.9971 11.4985 0.1901 6.8053 0.2913 0.7850 264.1726 5.7395 41.8041 12.1277 17.1255 115.3725 3.3577 213.7946 25.4895 8.3560 8.0287 18.1039 45.3079 2.0043 19.9210 36.6040 10.6691 25.5273 9.7464 39.0831 174.3593 23.7771 14.5381 4.3551 20.7626 18.7649 38.8610 6.9848 44.2690 87.8092 5.3581 118.7994 0.1293 11.2390 0.1331 12.1321 5.3803 6.6018 1.9526 13.7951 3.4553 0.9507 2.0979 11.9909 0.8268 10.2264 9.4881 25.7933 18.5625 1.7907 79.6948 150.6444 29.6227 54.5249 181.4085 19.0844 18.7826 49.1405 40.0161 60.0072 21.3091 64.6787 12.6432 50.1809 9.6243 8.8283 17.0416 23.5426 53.1939 44.2661 115.1137 25.9002 1.6901 1.2363 54.2869 77.1879 9.5447 40.3196 4.5930 16.4260 4.8987 7.6073 117.0913
temp: 298.150 k
press: 1.00000 atm
elementType: 16 8 8 7 7 6 6 6 6 6 6 6 6 6 6 6 6 6 6 6 6 6 6 6 6 1 1 1 1 1 1 1 1 1 1 1 1 1 1 1 1 1 1 1 1 1 1 1 1 1 1 1 1 1 1
symmnumber: 1
zpe: 1208428.6 jmol-1
zpe.correction: 0.460266 hartree
zpe.thermalcorrener: 0.487951 hartree
zpe.thermalcorrenthalpy: 0.488895 hartree
zpe.thermalcorrgfe: 0.403208 hartree
zpe.sumelectzpe: -1436.172085 hartree
zpe.sumelectthermal: -1436.144401 hartree
zpe.sumelectthermalent: -1436.143456 hartree
zpe.sumelectthermalfe: -1436.229144 hartree
dipole: -0.2678 1.2751 0.5581
dipole: 1.4174
quadrupole: -119.7727 -161.9579 -160.5435
quadrupole: -26.8332 -2.0109 -1.3712
quadrupole: 27.6520 -14.5332 -13.1188 -26.8332 -2.0109 -1.3712
hfenergy: -1436.6323514 hartree
pointgroup: C01 [X(C20H30N2O2S1)]
dipole: -0.0522756 0.5440881 0.1105651 debye
polarizability: 438.6731515|-28.3963555|275.1212038|10.6788966|-20.5449582|171.6121047 unknown
InChI: InChI=1S/C20H30N2O2S/c1-19(2,3)14-9-13(10-15(17(14)23)20(4,5)6)11-16-18(24)22(12-25-16)21(7)8/h9-11,23H,12H2,1-8H3
charge 0 multiplicity 1
55 atoms
S  -2.317318 1.766784 -0.484134
O  4.463657 0.144945 -0.034706
O  -3.866802 -1.880487 -0.062496
N  -4.61873 0.344688 -0.334902
N  -5.984513 -0.014213 -0.311461
C  2.793709 2.402944 -0.638213
C  3.511023 -2.655202 0.473924
C  2.226111 0.986668 -0.354326
C  2.574174 -1.447471 0.179221
C  3.077999 -0.127326 -0.065016
C  0.83667 0.744944 -0.371382
C  1.174913 -1.61146 0.13907
C  3.572298 2.925872 0.608077
C  3.737374 2.362827 -1.880105
C  1.66841 3.428269 -0.945711
C  2.70731 -3.967967 0.689827
C  4.320799 -2.424457 1.792634
C  4.465712 -2.926936 -0.735275
C  0.277828 -0.539751 -0.12238
C  -1.150655 -0.843143 -0.119087
C  -2.258484 -0.048827 -0.251516
C  -3.628069 -0.650495 -0.203657
C  -4.21879 1.755319 -0.441232
C  -6.697715 0.235545 -1.578363
C  -6.693649 0.367665 0.925834
H  0.172051 1.580643 -0.595743
H  0.7436 -2.599843 0.319631
H  4.413137 2.262698 0.863191
H  2.900748 2.99765 1.483957
H  3.972786 3.936301 0.399574
H  3.186287 2.022295 -2.776636
H  4.127917 3.378209 -2.08323
H  4.590331 1.68722 -1.714261
H  0.971989 3.549878 -0.095404
H  1.083158 3.148613 -1.841388
H  2.129251 4.413446 -1.142676
H  2.115168 -4.238895 -0.202625
H  2.024793 -3.896206 1.555672
H  3.412362 -4.796028 0.887799
H  4.981579 -1.53715 1.783106
H  4.958427 -3.303696 2.000034
H  3.627719 -2.290233 2.642225
H  5.125433 -2.080456 -1.003344
H  3.873192 -3.161463 -1.637675
H  5.115662 -3.793438 -0.512972
H  -1.416583 -1.90257 0.022437
H  4.970976 -0.67192 0.186563
H  -4.583781 2.216154 -1.375175
H  -4.547008 2.34412 0.433547
H  -6.103379 -0.171324 -2.41237
H  -6.915799 1.312514 -1.779179
H  -7.659755 -0.30528 -1.546483
H  -6.906125 1.460412 1.014734
H  -6.098344 0.045003 1.795191
H  -7.657454 -0.170087 0.952771
