program: Gaussian 09
title: 000010579
version: EM64L-G09RevD.01
frameworkgroup: C1[X(C23H23N2S2)]
method: RPBEPBE
basis: SDD
operation: Freq
keyword: #p
keyword: freq=noraman
keyword: PBEPBE/SDD
title: #p freq=noraman PBEPBE/SDD
converged: YES YES NO NO
title: Mulliken charges:
elementType: S S N N C C C C C C C C C C C C C C C C C C C C C C C H H H H H H H H H H H H H H H H H H H H H H H
charge: 0.272646 0.272533 -0.204137 -0.204366 0.610466 0.610541 -0.394329 -0.394322 -0.005430 -0.005424 -0.359071 -0.358717 -0.341708 -0.341822 -0.272413 -0.272538 -0.647876 -0.647959 -0.252936 -0.252884 -0.214737 -0.214745 -0.231812 -0.231769 -0.160221 -0.160401 -0.224854 0.244834 0.240180 0.240314 0.244733 0.253615 0.253484 0.260614 0.260616 0.237570 0.242606 0.242937 0.242567 0.237627 0.242907 0.247181 0.247384 0.250173 0.250186 0.253748 0.253714 0.224071 0.224016 0.233207
chargesum: 1.00000
title: Mulliken charges with hydrogens summed into heavy atoms:
elementType: S S N N C C C C C C C C C C C C C C C C C C C C C C C
charge: 0.272646 0.272533 -0.204137 -0.204366 0.610466 0.610541 0.090685 0.090725 -0.005430 -0.005424 -0.359071 -0.358717 -0.088092 -0.088339 -0.011798 -0.011923 0.075237 0.075142 -0.005755 -0.005500 0.035436 0.035441 0.021936 0.021945 0.063850 0.063616 0.008354
polarizability: 1.16843429e+03 -4.87009894e-03 3.06751948e+02 1.01398528e+01 -1.20874533e-02 1.28525132e+02
1716.lowfreq: -2.6310 -0.0017 -0.0010 0.0002 2.5635 9.9552 19.6644 20.6962 21.7529
frequency: 19.6574 20.6541 21.4815 44.5304 58.3360 62.8631 78.7284 80.6925 90.7281 101.3676 144.8252 162.0546 162.5980 179.4820 181.3943 199.7464 211.4795 212.9408 248.0067 269.0323 281.4914 303.6004 318.4725 349.2597 361.6097 376.1362 397.8380 407.3501 409.3315 418.1617 436.1187 437.9890 491.0585 491.4623 520.4739 523.4088 527.1908 527.4017 529.2267 571.3547 599.6820 604.4630 615.5045 678.3071 680.2024 685.4710 690.2860 722.9265 723.0039 760.4699 760.5858 770.7223 772.1548 808.3344 825.6381 825.8829 834.7860 856.3553 856.4471 894.2894 905.2654 931.8586 932.0975 946.5198 946.5894 989.3295 992.5612 992.6037 1024.9518 1025.1155 1028.3750 1028.7565 1047.6131 1049.0284 1089.3488 1089.5784 1135.6782 1136.2329 1140.1533 1140.6934 1181.3960 1182.6233 1192.7435 1217.9386 1232.4383 1234.1793 1247.5782 1261.0244 1271.5579 1277.3419 1284.9827 1297.7472 1299.5473 1309.5089 1311.0962 1332.6846 1345.0958 1346.5066 1371.1102 1399.4978 1399.6895 1402.3843 1402.5452 1442.4089 1449.0816 1455.7681 1456.1458 1469.7226 1471.3362 1475.0665 1482.9621 1484.1801 1506.0102 1510.0746 1528.9363 1589.6891 1592.3196 1596.5826 1596.8200 1601.4199 1625.1109 2999.3041 2999.3783 3037.8097 3038.0044 3081.3547 3081.6968 3082.5869 3082.7954 3100.9425 3101.1728 3104.9963 3108.4345 3108.6021 3136.9804 3137.1390 3152.1816 3152.2562 3161.0890 3161.1399 3171.1449 3171.2312 3184.3471 3184.3875
redmass: 4.9230 5.5897 6.0406 7.1468 3.7612 2.9677 4.6934 3.7623 3.6769 4.4407 5.2382 1.9198 5.5066 5.1305 4.0689 5.7952 1.0717 1.0795 4.4063 4.4216 4.2688 3.6060 2.8612 2.2226 3.6255 4.1429 3.9329 4.3701 4.4556 6.3759 3.4698 3.6138 8.6389 8.0590 4.4948 5.2379 4.2572 4.2781 4.2467 5.0713 5.0917 4.9860 4.3575 5.8092 4.4110 5.9575 5.0468 3.4714 3.4781 1.3554 1.3556 1.7490 1.6361 1.3522 1.9429 1.9261 1.7325 1.3519 1.3513 2.0654 1.2032 2.6128 2.6416 1.3688 1.3687 1.1121 1.3326 1.3308 3.0063 3.1896 5.0947 4.4591 2.7721 2.8673 1.9400 1.9430 1.8658 1.7972 1.5047 1.4853 1.1249 1.0845 1.5795 2.5366 1.6841 2.9078 1.6800 1.4732 1.5880 1.4916 1.4259 1.5551 1.7279 2.1352 2.3402 1.5273 1.3733 1.4430 2.2382 6.1681 5.5679 1.2521 1.2737 2.4954 2.4525 2.6063 2.6452 1.2899 1.0461 1.8719 1.0444 1.1329 1.1098 1.1663 4.7052 6.6966 6.7154 6.6623 7.0493 4.7957 5.8542 1.0362 1.0361 1.0610 1.0611 1.0909 1.0909 1.1024 1.1024 1.0996 1.0996 1.0894 1.1029 1.1030 1.0885 1.0884 1.0867 1.0867 1.0902 1.0903 1.0956 1.0956 1.1008 1.1008
irintensity: 0.0192 0.0532 1.0013 0.0007 0.0321 0.0101 0.3694 0.2453 0.0007 0.9784 0.2243 0.1424 0.0026 0.0886 0.7248 0.0002 0.6190 0.0347 3.2111 0.4755 0.3340 1.0956 0.5968 0.5060 4.3949 0.2334 3.0102 11.2324 2.1484 0.7820 1.0304 9.0199 0.0614 32.2595 0.3494 10.2716 1.9325 0.7940 7.0030 0.4030 2.1679 0.0353 3.5100 0.0035 29.4060 20.5024 5.3965 5.0068 6.0176 3.4373 191.8922 128.4878 2.1539 24.7519 4.0999 54.2138 0.9524 0.2518 0.4404 12.4495 0.0201 3.6432 1.1002 1.1817 1.4762 105.5216 0.1853 0.9570 0.4557 25.3649 5.8347 54.6956 3.7928 2.7313 68.0382 16.4050 3.1149 116.6200 9.3794 14.4771 31.3384 0.1485 211.5611 33.3150 151.7024 0.0679 846.0565 293.4084 19.1887 1.7798 2.4810 0.7617 250.9142 66.4559 94.8652 4.8844 79.2781 0.0705 417.6553 27.0749 3.1335 35.3523 11.2836 1.1970 0.4800 40.1932 142.2890 4.7709 31.7728 6.6777 6.2239 6.6954 111.3007 14.0700 5407.7184 3.2462 22.6165 48.7463 3.2395 1149.2195 3.3573 14.3981 10.4228 42.0489 18.2126 2.7473 0.7194 0.2273 0.2677 26.3307 28.5242 12.9435 23.5965 15.8401 3.3267 8.0360 1.7015 1.5762 1.6970 1.8542 6.1159 6.4908 29.4229 2.4128
temp: 298.150 k
press: 1.00000 atm
elementType: 16 16 7 7 6 6 6 6 6 6 6 6 6 6 6 6 6 6 6 6 6 6 6 6 6 6 6 1 1 1 1 1 1 1 1 1 1 1 1 1 1 1 1 1 1 1 1 1 1 1
symmnumber: 1
zpe: 1049371.6 jmol-1
zpe.correction: 0.399685 hartree
zpe.thermalcorrener: 0.425138 hartree
zpe.thermalcorrenthalpy: 0.426082 hartree
zpe.thermalcorrgfe: 0.341849 hartree
zpe.sumelectzpe: -1793.756757 hartree
zpe.sumelectthermal: -1793.731304 hartree
zpe.sumelectthermalent: -1793.730360 hartree
zpe.sumelectthermalfe: -1793.814593 hartree
dipole: -0.0071 3.6719 0.0017
dipole: 3.6719
quadrupole: 23.7647 -129.5357 -181.3027
quadrupole: 0.0026 0.7794 -0.0063
quadrupole: 119.4560 -33.8445 -85.6115 0.0026 0.7794 -0.0063
hfenergy: -1794.1564414 hartree
pointgroup: C01 [X(C23H23N2S2)]
dipole: 0.0148014 -1.4444527 0.0174634 debye
polarizability: 1167.7261195|10.1607776|306.8435948|-26.6959726|-2.5608889|129.1416597 unknown
InChI: InChI=1S/C23H23N2S2/c1-3-24-18-12-8-10-14-20(18)26-22(24)16-6-5-7-17-23-25(4-2)19-13-9-11-15-21(19)27-23/h5-17H,3-4H2,1-2H3
charge 1 multiplicity 1
50 atoms
S  -3.842762 1.499313 0.147453
S  3.848485 1.590086 -0.097854
N  -4.948592 -0.903802 0.298768
N  5.012726 -0.788505 -0.188717
C  -6.051096 -0.009835 0.280572
C  6.093099 0.132293 -0.193204
C  -5.139051 -2.378167 0.358239
C  5.238385 -2.25893 -0.212385
C  -3.69951 -0.313458 0.209565
C  3.749384 -0.226665 -0.114594
C  -5.654929 1.352325 0.215054
C  5.663889 1.485579 -0.162281
C  -7.423389 -0.344736 0.324614
C  7.473069 -0.170419 -0.228867
C  -6.590898 2.398324 0.202793
C  6.574196 2.553911 -0.177133
C  -5.263932 -3.014416 -1.040677
C  5.372306 -2.859625 1.201258
C  -2.463244 -0.987096 0.16436
C  2.530149 -0.929112 -0.053475
C  -8.369156 0.702094 0.311704
C  8.393227 0.898971 -0.243324
C  -7.963087 2.05899 0.253507
C  7.954254 2.246619 -0.219855
C  -1.209551 -0.34466 0.10353
C  1.260943 -0.316218 -0.008738
C  0.033993 -1.009387 0.056003
H  -6.043294 -2.568123 0.960328
H  -4.295182 -2.812043 0.919689
H  4.407662 -2.725718 -0.767097
H  6.149582 -2.441403 -0.806216
H  -7.758501 -1.384956 0.362367
H  7.8329 -1.20296 -0.239383
H  -6.275193 3.444373 0.154617
H  6.233396 3.592956 -0.155755
H  -4.353881 -2.846124 -1.641898
H  -6.122678 -2.59851 -1.594865
H  -5.415427 -4.103511 -0.941715
H  6.219154 -2.411684 1.748816
H  4.456399 -2.699014 1.795647
H  5.549307 -3.946912 1.127757
H  -2.476555 -2.082837 0.16821
H  2.570132 -2.023962 -0.03075
H  -9.435366 0.458194 0.345038
H  9.465051 0.680295 -0.270734
H  -8.714976 2.853531 0.244451
H  8.686658 3.05913 -0.23174
H  -1.185835 0.756623 0.090438
H  1.210644 0.78416 -0.023971
H  0.047095 -2.108477 0.070052
