program: Gaussian 09
title: 000131506
version: EM64L-G09RevD.01
frameworkgroup: C1[X(C9H10IN)]
method: RPBEPBE
basis: SDD
operation: Freq
keyword: #p
keyword: freq=noraman
keyword: PBEPBE/SDD
title: #p freq=noraman PBEPBE/SDD
converged: YES YES NO NO
title: Mulliken charges:
elementType: I N C C C C C C C C C H H H H H H H H H H
charge: 0.080067 -0.578757 -0.125549 -0.570826 -0.569651 0.303950 0.294786 -0.351237 -0.413016 -0.335593 -0.165647 0.239897 0.217018 0.245706 0.225352 0.216885 0.262021 0.245277 0.257671 0.274749 0.246897
chargesum: 0.00000
title: Mulliken charges with hydrogens summed into heavy atoms:
elementType: I N C C C C C C C C C
charge: 0.080067 -0.046337 0.114348 -0.108102 -0.127414 0.303950 0.294786 -0.089216 -0.167739 -0.335593 0.081250
polarizability: 1.98016609e+02 -5.18113487e+00 1.11594880e+02 1.78399123e+00 1.56651098e+00 5.95366483e+01
1716.lowfreq: -3.7522 -0.0005 -0.0005 -0.0004 5.4937 16.0580 61.4847 120.1786 133.5601
frequency: 61.4725 120.1734 133.5588 196.1390 213.0215 242.7237 286.5387 298.1133 412.8052 424.1803 438.0703 485.6245 525.3496 569.6491 612.2254 628.7499 698.7270 777.3448 814.9225 836.3726 848.6137 874.0809 899.5758 947.8815 973.2050 1025.1928 1054.4907 1092.3757 1114.2343 1125.2611 1131.5276 1172.9990 1214.1208 1220.3401 1245.6161 1273.0149 1282.0124 1293.1581 1368.0604 1378.4359 1398.5395 1449.7695 1455.8183 1465.8549 1574.2583 1603.1420 1638.7352 2959.1093 2962.3186 3002.4309 3043.9796 3067.3863 3131.7129 3155.8184 3165.0635 3459.2887 3589.8354
redmass: 4.1361 3.4319 6.3478 2.3579 9.3066 1.3232 3.3832 2.3849 2.3603 2.4688 2.7175 3.4199 3.4745 1.5282 6.4265 5.8207 3.2642 3.3622 1.3222 3.4005 5.1434 1.3857 1.4848 1.3715 1.5542 3.2919 2.3018 1.5141 1.3416 1.7290 2.1172 1.9274 1.6923 1.3419 1.8057 1.7809 1.3249 1.2685 6.1711 1.4274 3.5634 1.0907 1.3144 2.0445 7.6375 7.6271 1.0973 1.0660 1.0690 1.0844 1.0966 1.0945 1.0895 1.0927 1.0957 1.0448 1.0978
irintensity: 0.9652 0.9769 0.7781 2.6772 2.8182 42.9665 3.4604 27.7190 9.0324 11.2279 22.5647 3.7034 11.3515 271.1114 11.6296 3.9255 3.6633 0.0283 39.1585 1.6446 38.9801 7.8422 1.2520 2.2349 8.2260 13.5606 13.7592 3.8911 8.8997 11.5647 47.7067 16.7797 9.4082 2.8950 2.0448 8.9620 1.6128 0.6219 2.0823 16.3668 20.4249 14.0280 14.1013 49.1432 10.4537 16.4675 44.6934 38.9699 29.1857 27.5156 35.8057 24.4815 9.5936 4.4520 7.1616 0.7701 0.8250
temp: 298.150 k
press: 1.00000 atm
elementType: 53 7 6 6 6 6 6 6 6 6 6 1 1 1 1 1 1 1 1 1 1
symmnumber: 1
zpe: 439227.0 jmol-1
zpe.correction: 0.167293 hartree
zpe.thermalcorrener: 0.177458 hartree
zpe.thermalcorrenthalpy: 0.178402 hartree
zpe.thermalcorrgfe: 0.130162 hartree
zpe.sumelectzpe: -414.411708 hartree
zpe.sumelectthermal: -414.401543 hartree
zpe.sumelectthermalent: -414.400599 hartree
zpe.sumelectthermalfe: -414.448839 hartree
dipole: -3.1038 1.2805 -0.4588
dipole: 3.3888
quadrupole: -69.7150 -76.9337 -81.2447
quadrupole: -6.2105 2.5295 1.3042
quadrupole: 6.2494 -0.9692 -5.2802 -6.2105 2.5295 1.3042
hfenergy: -414.579001 hartree
pointgroup: C01 [X(C9H10I1N1)]
dipole: 1.1358967 -0.6677366 -0.2035664 debye
dipolederiv: -0.544349 0.1626271 0.0164724 0.200986 -0.1066937 -0.0064397 0.0197267 -0.0077377 -0.024507 -0.9048472 -0.2227996 0.0270054 -0.3888292 -0.6454256 -0.1303771 0.0447953 -0.1068174 -0.2134681 0.8575792 0.1825349 -0.0579538 0.1496667 0.2976897 0.0640268 -0.0181601 0.034684 0.2522492 -0.1433593 0.0143991 -0.0157779 0.0785727 -0.0087184 0.0434439 -0.0269422 0.0500534 0.1539584 -0.230705 -0.1038194 0.0038761 -0.1568366 -0.0544514 -0.0593869 -0.0127785 -0.0836948 0.1375418 0.1312242 0.1473213 -0.0132943 0.2143099 0.0747591 -0.0069906 -0.0676922 -0.0418174 -0.0361377 0.2230891 -0.0783409 -0.0143769 -0.3265498 -0.1142269 0.0095664 -0.1130381 0.0175309 -0.0496285 -0.4687808 -0.0181509 0.0098375 0.1752417 0.000828 -0.0103633 0.0298994 0.000268 -0.1063483 0.0043377 -0.0331952 -0.0080831 0.0949845 0.1021024 -0.004316 0.0202271 0.0028358 -0.1467187 1.1094409 -0.3810292 -0.0438958 -0.5104196 0.1548632 0.0187359 -0.0445962 0.0191706 -0.1594202 -0.4218444 0.2239021 0.0084261 0.1519638 -0.0848621 -0.0099762 0.0204852 -0.0139445 -0.1142709 0.0348131 -0.0079639 0.0059781 -0.0348702 0.0305524 0.0071902 -0.0199327 0.0007178 -0.1668896 -0.0338654 -0.059272 0.0586131 -0.0351539 0.0595115 0.0335058 0.0726214 0.0861393 -0.116703 0.0347285 -0.0003953 0.0007918 -0.0234 -0.081531 -0.0793956 -0.0380359 -0.1142498 0.0371231 -0.0131571 0.0515324 -0.0276821 0.0671618 -0.0869646 0.0836547 -0.0877193 0.1185389 0.0242514 -0.0630908 0.0431842 0.0702605 0.0116049 0.0704175 -0.015808 0.1096432 -0.0737063 -0.1182429 0.0992072 0.0141281 0.000455 0.0220991 -0.0518797 0.0012554 -0.0057183 -0.001116 0.1547632 0.0411005 0.0558853 0.0021823 0.0303733 -0.1037801 0.0009184 -0.0036241 0.002305 0.1543478 0.1841668 0.025719 -0.0415106 0.0895747 0.3063474 -0.0627235 0.0344879 0.0128195 -0.0066528 0.1195599 0.0754103 0.0115807 0.2671744 0.198578 0.1188282 0.0807306 0.0910729 0.1832947 -0.0152478 -0.0916773 0.0070953 -0.0776543 0.0428842 0.0046511 0.0056209 0.0069481 0.1614582 unknown
polarizability: 194.8102496|-16.8541606|114.6796553|-4.6017277|-0.8746859|59.6582331 unknown
InChI: InChI=1S/C9H10IN/c10-8-2-1-6-4-9(11)5-7(6)3-8/h1-3,9H,4-5,11H2
charge 0 multiplicity 1
21 atoms
I  -4.258193 0.988592 0.093508
N  3.861201 0.498932 -0.119755
C  2.501028 0.207024 0.34158
C  1.472378 1.287667 -0.122354
C  1.842771 -1.152066 -0.117112
C  0.142782 0.554339 -0.060466
C  0.353835 -0.852347 -0.054882
C  -1.159689 1.090844 -0.025126
C  -0.744798 -1.731852 -0.009224
C  -2.250592 0.191518 0.020503
C  -2.062965 -1.208479 0.030022
H  2.518563 0.210029 1.44887
H  1.701517 1.590776 -1.166308
H  1.518384 2.199777 0.49601
H  2.1520 -2.009999 0.507372
H  2.155184 -1.372655 -1.159956
H  -1.323262 2.172548 -0.026801
H  -0.598614 -2.818058 0.000007
H  3.963939 0.542885 -1.138685
H  4.600922 -0.051132 0.32472
H  -2.922891 -1.883445 0.070879
