program: Gaussian 09
title: 000131498
version: EM64L-G09RevD.01
frameworkgroup: C1[X(C21H27N3O5)]
method: RPBEPBE
basis: SDD
operation: Freq
keyword: #p
keyword: freq=noraman
keyword: PBEPBE/SDD
title: #p freq=noraman PBEPBE/SDD
converged: YES YES NO NO
title: Mulliken charges:
elementType: O O O O O N N N C C C C C C C C C C C C C C C C C C C C C H H H H H H H H H H H H H H H H H H H H H H H H H H H
charge: -0.272012 -0.266014 -0.266237 -0.215959 -0.266951 -0.227159 -0.599458 -0.001129 -0.321399 0.230315 -0.509223 -0.397576 0.250913 0.275566 0.247835 -0.137323 -0.185325 0.325648 -0.690180 -0.707788 -0.699886 -0.707526 -0.436434 0.491427 -0.400445 -0.436165 -0.232544 -0.223773 -0.236353 0.306838 0.283043 0.244172 0.241979 0.242291 0.238989 0.218728 0.216531 0.236961 0.221274 0.258918 0.217909 0.224841 0.248406 0.204218 0.248362 0.260982 0.210344 0.267038 0.312080 0.232660 0.256483 0.296379 0.234522 0.231210 0.229407 0.230591
chargesum: 0.00000
title: Mulliken charges with hydrogens summed into heavy atoms:
elementType: O O O O O N N N C C C C C C C C C C C C C C C C C C C C C
charge: -0.272012 -0.266014 -0.266237 -0.215959 -0.266951 -0.227159 -0.020340 -0.001129 -0.014561 0.230315 0.017992 0.086693 0.250913 0.275566 0.247835 -0.137323 0.053665 0.325648 -0.017960 -0.009688 -0.022421 0.012162 0.052709 0.491427 -0.104066 -0.201643 -0.001334 0.005634 -0.005761
polarizability: 2.97229865e+02 1.77230782e+01 2.60464618e+02 3.48270421e+00 2.72136953e+01 2.08294897e+02
1716.lowfreq: -14.2968 -8.9660 -4.7124 -0.0010 -0.0009 -0.0006 1.4892 17.3105 24.4757
frequency: -9.8061 17.1937 24.3039 35.7774 37.4028 45.5601 48.7823 59.4754 71.5779 76.3752 100.3817 114.6186 117.9279 127.6371 129.0259 140.2364 166.3777 170.5215 178.8992 198.5773 208.1766 226.8182 232.0017 242.6225 244.4588 250.1270 274.5218 279.7111 283.8625 298.3235 305.0723 319.5095 324.3729 339.4481 369.8194 382.9500 405.4270 405.8721 430.1553 440.7033 441.9607 453.9380 486.9869 506.9989 510.9486 535.5228 574.3953 592.0480 602.1436 616.2728 654.1655 679.8896 689.4071 707.9510 709.1583 724.8968 733.1140 755.2628 758.6098 796.3802 802.5928 833.3471 852.0318 865.0745 876.5937 894.1131 914.9578 920.5666 924.2082 931.0281 957.2713 972.8718 985.4094 989.9489 991.2355 996.2110 1001.9440 1009.2836 1027.6905 1029.2525 1032.4300 1037.9350 1046.8605 1047.6200 1062.2088 1092.6209 1099.8435 1125.8525 1140.4853 1146.0813 1173.8698 1176.6090 1183.5067 1189.9694 1195.3947 1206.1377 1209.2661 1225.2250 1231.9121 1258.6119 1270.4526 1289.8548 1298.6143 1307.0301 1329.2433 1331.2992 1333.0088 1349.7615 1352.1465 1374.3194 1378.8439 1383.5257 1386.2805 1406.0365 1410.0374 1442.7581 1445.7335 1461.7718 1466.8351 1467.8150 1469.6160 1471.4654 1472.3335 1477.0672 1478.3790 1489.1335 1491.0238 1499.4864 1563.8594 1594.8144 1611.5374 1616.4291 1630.2247 1636.5969 2207.0685 2971.1590 2982.7675 2988.8588 2991.3193 2994.6009 2999.2578 3019.2897 3037.3708 3050.7712 3066.0998 3076.6036 3083.9320 3088.0536 3089.1623 3091.7157 3098.7369 3103.3009 3108.2441 3113.1067 3117.4745 3119.4001 3125.6268 3136.1311 3147.7687 3163.7219 3456.8575 3596.7806
redmass: 3.4318 4.5280 3.9886 3.8659 4.7332 4.2987 4.0901 3.8338 6.6364 6.9762 6.8526 5.0138 6.7746 3.7815 5.9887 5.1156 2.7966 1.4975 2.1776 4.8660 2.9752 1.2610 1.0823 1.1096 4.6371 3.3497 2.2993 2.4865 1.9102 2.8922 3.4378 4.8486 3.4873 2.9188 4.4222 6.1608 2.8499 2.7518 2.9242 3.2958 3.4771 2.8747 7.0172 5.5950 5.2078 3.7460 5.1923 1.4981 3.7229 6.3479 9.5293 3.3814 6.0986 1.9890 6.5512 6.3750 5.0633 1.7223 5.0016 3.9578 3.1918 3.8858 4.3059 1.2845 2.0147 2.3777 2.4156 1.6239 1.6762 1.6099 1.2047 2.7416 1.9158 1.8333 3.2255 2.1444 1.6457 1.3842 2.2074 1.5064 2.2701 1.6719 2.7355 3.6478 5.3584 1.5776 2.5222 3.3007 2.0883 1.5810 1.0554 1.9296 3.2628 2.4425 1.1386 1.3661 1.6676 1.5804 2.0870 3.0600 2.9311 1.5384 1.3850 1.3913 1.7053 1.3589 1.3645 1.4011 1.6576 1.2280 1.2210 1.2248 6.9215 1.2139 2.3819 2.1716 1.0463 1.0520 1.0498 1.0558 1.0869 1.0740 1.0956 1.0610 1.1078 2.2456 1.0942 1.0572 3.7603 6.0387 8.9681 5.8575 1.3077 11.2418 12.6701 1.0360 1.0796 1.0705 1.0361 1.0357 1.0368 1.0575 1.0611 1.0851 1.0991 1.0979 1.0992 1.1071 1.1012 1.0990 1.0992 1.1006 1.1051 1.1004 1.1002 1.0868 1.0876 1.0923 1.0964 1.1015 1.0452 1.0980
irintensity: 0.7102 0.9322 1.5232 0.3865 0.5464 2.4598 0.6259 0.0092 2.9668 3.1256 4.9291 0.7722 1.1537 1.7245 2.2066 0.6442 3.0349 0.9576 3.1491 0.6184 1.7563 0.6265 0.6982 0.1896 5.9066 3.6094 23.3130 16.3100 37.7985 1.4365 10.8748 16.7605 2.0315 4.7656 12.8381 21.0621 0.9220 2.7536 10.5371 3.8945 2.9849 1.1943 3.1740 5.3596 11.2789 1.8542 8.6049 255.6565 16.0383 1.4464 6.0392 3.1175 23.3499 43.9024 4.8508 9.4434 15.4957 77.1026 5.0648 4.3981 13.5504 3.7489 19.4298 0.9777 17.7474 34.3217 16.2544 4.0978 11.7401 2.7756 0.1497 35.4532 6.1381 2.9504 6.0833 12.5709 17.2184 5.6190 8.6796 1.4040 17.5090 7.2670 5.6312 21.1766 50.0502 4.3835 13.2280 581.8947 171.8680 28.2659 0.1404 10.3416 48.3514 16.8344 0.2238 15.2915 6.4937 10.4415 4.7113 25.8606 33.8407 83.3980 2.8319 50.7288 96.2949 8.1195 26.7586 11.5876 0.8636 7.0893 40.0555 35.9104 0.8029 27.0920 53.4622 10.8555 0.5116 12.5051 4.8019 3.7176 22.7489 23.9150 7.8148 13.0888 8.6290 9.6733 1.0104 34.8932 225.1198 2.3133 224.2143 1.6622 17.1172 201.5722 0.3892 22.2750 20.5259 63.4920 15.1833 14.3217 24.9108 17.7799 12.4160 2.4881 54.1325 11.5807 10.4094 8.2628 25.8637 6.2207 50.5134 21.9634 12.0024 9.6471 19.0345 5.8815 7.1624 12.7395 18.2451 33.7863 11.6319 10.0487
temp: 298.150 k
press: 1.00000 atm
elementType: 8 8 8 8 8 7 7 7 6 6 6 6 6 6 6 6 6 6 6 6 6 6 6 6 6 6 6 6 6 1 1 1 1 1 1 1 1 1 1 1 1 1 1 1 1 1 1 1 1 1 1 1 1 1 1 1
symmnumber: 1
zpe: 1180267.0 jmol-1
zpe.correction: 0.449540 hartree
zpe.thermalcorrener: 0.479461 hartree
zpe.thermalcorrenthalpy: 0.480406 hartree
zpe.thermalcorrgfe: 0.387600 hartree
zpe.sumelectzpe: -1354.626362 hartree
zpe.sumelectthermal: -1354.596440 hartree
zpe.sumelectthermalent: -1354.595496 hartree
zpe.sumelectthermalfe: -1354.688301 hartree
dipole: 1.7893 5.0361 4.8371
dipole: 7.2084
quadrupole: -139.9011 -191.1076 -167.3289
quadrupole: -6.1308 -3.0156 -10.7700
quadrupole: 26.2114 -24.9951 -1.2163 -6.1308 -3.0156 -10.7700
hfenergy: -1355.0759017 hartree
pointgroup: C01 [X(C21H27N3O5)]
dipole: 1.1869595 -1.6660921 -1.9642502 debye
polarizability: 303.4222355|-4.7082051|252.62296|-12.4508648|26.395662|209.9441849 unknown
InChI: InChI=1S/C21H27N3O5/c1-14(23)17(25)24-11-10-16(18(26)29-20(2,3)4)21(24,13-22)19(27)28-12-15-8-6-5-7-9-15/h5-9,14,16H,10-12,23H2,1-4H3
charge 0 multiplicity 1
56 atoms
O  -3.390611 -0.543193 -0.530737
O  1.039358 -0.025064 0.709322
O  -1.449319 -1.838245 -0.786328
O  -0.903727 -0.02568 2.012978
O  0.867517 3.081617 1.341578
N  0.291057 2.156383 -0.689328
N  2.39312 5.005068 0.078726
N  -2.67496 2.934976 1.043072
C  -1.429236 0.583594 -1.254206
C  -0.786874 1.378736 -0.029814
C  -0.25373 0.439402 -2.24238
C  0.493238 1.783621 -2.115514
C  -2.068001 -0.745503 -0.837782
C  -0.232007 0.393952 1.049965
C  1.088544 2.971139 0.09407
C  -1.80866 2.248098 0.600624
C  2.269716 3.694933 -0.575264
C  -4.26833 -1.655331 0.083828
C  3.537366 2.789384 -0.442575
C  -4.445432 -2.771532 -0.962598
C  -5.577955 -0.897312 0.350705
C  -3.612733 -2.144079 1.388571
C  1.663103 -1.078836 1.590747
C  2.451919 -2.024805 0.718449
C  1.791234 -2.815588 -0.258672
C  3.852647 -2.151216 0.885255
C  2.529602 -3.719056 -1.052651
C  4.589632 -3.062938 0.094536
C  3.928752 -3.848451 -0.876777
H  -2.222405 1.229172 -1.668136
H  0.391267 -0.397693 -1.929334
H  -0.605305 0.250527 -3.27007
H  1.566099 1.678433 -2.343601
H  0.06303 2.55601 -2.782298
H  2.052141 3.845493 -1.650543
H  4.406976 3.300804 -0.894768
H  3.417613 1.808255 -0.940807
H  3.750573 2.608291 0.625822
H  -4.865025 -2.365061 -1.899859
H  -3.487431 -3.269626 -1.180109
H  -5.1515 -3.525778 -0.569826
H  -5.994757 -0.491907 -0.587253
H  -5.404769 -0.058909 1.046309
H  -6.319892 -1.581871 0.799085
H  -2.699863 -2.726968 1.18978
H  -3.349312 -1.291175 2.036791
H  -4.331428 -2.786952 1.92889
H  3.269599 5.49709 -0.11043
H  2.134848 4.976181 1.071448
H  2.303432 -0.540619 2.309776
H  0.839895 -1.57543 2.135092
H  0.708549 -2.712327 -0.399834
H  4.368122 -1.5384 1.635317
H  2.014714 -4.327599 -1.804567
H  5.672162 -3.157579 0.234541
H  4.497438 -4.555737 -1.491014
