program: Gaussian 09
title: 000131494
version: EM64L-G09RevD.01
frameworkgroup: C1[X(C15H38N3)]
method: RPBEPBE
basis: SDD
operation: Freq
keyword: #p
keyword: freq=noraman
keyword: PBEPBE/SDD
title: #p freq=noraman PBEPBE/SDD
converged: YES YES NO NO
title: Mulliken charges:
elementType: N N N C C C C C C C C C C C C C C C H H H H H H H H H H H H H H H H H H H H H H H H H H H H H H H H H H H H H H
charge: -0.115184 -0.128762 -0.123460 -0.337254 -0.362321 -0.431915 -0.390135 -0.316564 -0.401335 -0.554723 -0.577649 -0.335383 -0.550632 -0.532445 -0.551719 -0.535204 -0.551383 -0.551727 0.280017 0.278912 0.263512 0.275275 0.257193 0.259977 0.244145 0.244319 0.279096 0.274713 0.241321 0.240699 0.278992 0.281673 0.279149 0.267654 0.282348 0.285465 0.273568 0.272490 0.256037 0.278690 0.296175 0.288960 0.278044 0.275598 0.275682 0.256646 0.296046 0.286400 0.274860 0.274217 0.290761 0.274631 0.258951 0.290548 0.259524 0.275505
chargesum: 3.00000
title: Mulliken charges with hydrogens summed into heavy atoms:
elementType: N N N C C C C C C C C C C C C C C C
charge: -0.115184 -0.128762 -0.123460 0.221675 0.176466 0.085255 0.098330 0.237245 0.080685 0.285091 0.257819 0.210675 0.280270 0.310157 0.276656 0.300272 0.272960 0.273850
polarizability: 2.11650806e+02 1.02266970e+00 1.63560970e+02 6.28127122e-01 -2.90408842e-02 1.51080867e+02
1716.lowfreq: -12.4347 -6.5093 -0.0674 -0.0007 0.0003 5.4551 8.5052 12.6445 29.3000
frequency: -7.6805 12.0984 29.2843 43.1293 58.5165 71.5949 88.2805 97.1544 106.4183 110.1781 135.6168 164.4034 178.1654 189.1793 193.4004 221.3502 241.8800 254.9666 257.0453 260.2195 267.8021 270.2851 281.3634 310.9542 336.9413 337.9132 340.5529 367.5587 373.3414 390.3911 425.1848 428.0130 428.6546 432.8152 452.4746 478.6895 502.3463 524.9181 558.0565 705.8285 726.2719 744.1793 749.1012 760.9745 787.1273 833.0297 851.3143 871.6637 882.3051 895.8121 909.5795 924.5386 926.6969 929.1775 939.6909 963.4531 1023.8274 1028.4092 1033.1346 1040.8392 1042.2364 1044.1633 1059.1601 1061.6362 1073.3345 1088.5254 1097.2619 1110.9203 1118.0703 1135.0498 1153.2302 1174.8779 1198.4332 1203.2427 1214.5903 1215.3961 1222.0996 1244.0599 1244.8095 1250.4203 1269.0084 1284.2378 1300.3981 1310.6227 1319.3817 1328.4392 1335.1951 1342.7756 1356.5399 1374.6526 1386.0009 1387.9244 1396.3566 1421.0866 1423.5233 1424.3383 1425.8605 1428.2900 1443.8982 1447.7459 1448.7063 1453.2808 1454.6307 1457.3506 1457.9127 1459.5373 1461.0040 1461.0538 1463.5543 1469.1528 1470.4037 1471.4793 1476.2348 1477.4999 1484.6289 1485.7598 1487.9166 1488.2602 1489.5929 1489.8100 1493.5804 1498.6675 1500.0949 1501.0103 2998.9904 3005.8025 3012.5096 3016.0303 3017.6895 3019.8106 3024.2425 3025.7216 3026.6234 3027.2449 3027.5122 3030.8766 3030.9643 3031.3864 3033.3827 3052.4217 3069.4316 3071.4769 3085.7861 3091.4127 3098.7571 3103.4470 3143.3050 3143.4828 3144.2774 3145.1985 3145.3696 3145.9706 3146.2598 3146.8616 3150.8433 3151.0177 3151.3037 3151.9844 3153.6112 3153.9827 3154.6584 3163.4505
redmass: 2.5937 2.7484 3.7352 2.9882 1.8681 2.3402 2.2920 2.2326 2.0638 1.9582 2.1813 3.3615 1.6583 1.2239 1.6336 2.0609 1.6716 1.3903 1.3393 1.1029 1.0639 1.1097 1.1691 2.2139 2.2453 2.2020 2.2227 2.5954 2.4383 2.7227 2.4083 2.2760 2.3352 2.7462 2.7152 2.5988 2.7100 3.0020 3.0150 4.3045 4.1884 3.2998 1.1401 1.1568 1.2359 1.9309 2.4426 3.3152 3.1436 2.2122 3.1029 2.6390 2.7418 2.5018 2.3343 1.7349 3.5335 3.6627 3.2891 1.1978 1.2503 2.1486 1.9691 1.2988 1.5584 1.2072 1.2956 1.5013 1.6549 1.5175 1.4350 1.3200 1.6302 1.6978 1.8157 1.8226 1.8586 1.8488 1.8764 1.5729 1.4335 1.3403 1.2329 1.3346 1.0563 1.1417 1.1814 1.1959 1.2578 1.2982 1.2476 1.2474 1.2051 1.1514 1.1512 1.1469 1.1464 1.1499 1.1148 1.0796 1.0714 1.0547 1.0483 1.0862 1.0971 1.0930 1.0408 1.0404 1.0915 1.0657 1.0670 1.0810 1.0899 1.0528 1.0834 1.0546 1.0648 1.0634 1.0524 1.0613 1.0639 1.0652 1.0622 1.0564 1.0592 1.0592 1.0598 1.0589 1.0585 1.0574 1.0530 1.0325 1.0357 1.0323 1.0323 1.0339 1.0337 1.0334 1.0343 1.1018 1.1054 1.1046 1.1081 1.1080 1.1072 1.1073 1.1058 1.1057 1.1058 1.1061 1.1061 1.1055 1.1057 1.1056 1.1058 1.1066 1.1061 1.1060 1.1055 1.1054 1.1054 1.1046
irintensity: 0.0271 0.0186 0.2152 0.6286 0.0204 0.0915 0.2283 0.2292 0.0476 0.1844 0.2951 0.0188 0.0289 0.1243 0.1222 0.0565 0.2384 0.2592 0.1078 0.0382 0.0541 0.0808 0.0901 0.9487 0.1440 0.2715 0.2413 0.0946 0.1405 0.0495 0.4252 0.1786 0.1521 1.0321 0.1621 0.0703 0.2424 0.8390 3.2808 2.2670 2.0473 3.1174 12.4416 15.3389 0.2509 23.5654 54.1761 16.8961 12.4474 15.7473 19.6849 3.4462 22.0493 10.9211 6.3416 10.5106 0.4248 15.7649 29.1280 0.0423 0.4302 2.6641 0.0620 0.0254 2.5052 0.0352 2.3162 1.2488 2.0225 0.4429 0.6945 0.1291 1.9179 0.9194 3.4137 0.7443 0.3961 4.6975 1.4077 0.9956 2.0846 16.4227 7.6763 15.2471 0.5397 3.3940 0.0582 0.3455 0.3457 0.7649 7.5397 7.0094 7.4583 17.8945 20.9187 18.4769 18.0920 20.6654 7.7444 2.3778 1.4883 1.0635 1.3279 1.2913 6.3282 7.0236 1.4383 1.1181 4.0097 9.9354 0.8919 8.9336 2.4991 23.7820 0.2595 53.4594 110.9627 29.1791 35.7101 50.1944 17.8715 80.3864 100.4216 51.9168 0.2745 6.3159 0.4990 0.2885 0.4881 20.5331 6.6762 2.7671 4.3232 0.9752 1.0785 4.8181 2.1711 1.9770 0.0494 0.2018 2.6738 1.3814 0.0560 0.8296 23.7634 10.7338 0.5286 0.5421 1.0983 0.6882 0.8067 0.5400 1.3441 2.6058 1.3856 1.1243 1.5629 4.5521 5.7806 8.1592 2.3728 3.0192
temp: 298.150 k
press: 1.00000 atm
elementType: 7 7 7 6 6 6 6 6 6 6 6 6 6 6 6 6 6 6 1 1 1 1 1 1 1 1 1 1 1 1 1 1 1 1 1 1 1 1 1 1 1 1 1 1 1 1 1 1 1 1 1 1 1 1 1 1
symmnumber: 1
zpe: 1386472.5 jmol-1
zpe.correction: 0.528079 hartree
zpe.thermalcorrener: 0.551756 hartree
zpe.thermalcorrenthalpy: 0.552701 hartree
zpe.thermalcorrgfe: 0.474580 hartree
zpe.sumelectzpe: -756.109206 hartree
zpe.sumelectthermal: -756.085529 hartree
zpe.sumelectthermalent: -756.084585 hartree
zpe.sumelectthermalfe: -756.162705 hartree
dipole: -1.5978 -0.9024 -0.0987
dipole: 1.8377
quadrupole: 198.9445 -64.6442 -90.8118
quadrupole: 0.7978 0.1919 -0.1558
quadrupole: 184.4483 -79.1403 -105.3080 0.7978 0.1919 -0.1558
hfenergy: -756.6372856 hartree
pointgroup: C01 [X(C15H38N3)]
dipole: -0.6242252 0.3569154 0.0755568 debye
polarizability: 211.6216613|-1.646993|163.4281299|-0.2153272|1.4432772|151.2428508 unknown
InChI: InChI=1S/C15H38N3/c1-16(2,3)12-9-10-14-18(7,8)15-11-13-17(4,5)6/h9-15H2,1-8H3
charge 3 multiplicity 1
56 atoms
N  -0.654934 -1.666102 -0.212709
N  -5.100643 1.156046 0.068291
N  5.422938 0.782077 0.126693
C  -2.036889 -1.290074 0.406039
C  0.415972 -0.596291 0.164163
C  -2.761195 -0.041204 -0.161079
C  1.865837 -0.937098 -0.256179
C  -4.147284 0.031225 0.538965
C  2.852386 0.202771 0.154273
C  -0.280215 -3.031895 0.390976
C  -0.76986 -1.818997 -1.731987
C  4.292886 -0.21907 -0.223957
C  -5.461512 1.003667 -1.413451
C  -6.394307 1.034516 0.89871
C  -4.494896 2.541119 0.311157
C  6.753228 0.15466 -0.327783
C  5.237107 2.112247 -0.608084
C  5.495297 1.033787 1.635495
H  -1.858547 -1.181189 1.490947
H  -2.667914 -2.183979 0.253989
H  0.088942 0.345512 -0.310305
H  0.350808 -0.480816 1.261266
H  -2.182074 0.877182 0.039698
H  -2.894924 -0.141426 -1.252171
H  1.929564 -1.086706 -1.350259
H  2.195318 -1.873024 0.230592
H  -4.024019 0.179044 1.626773
H  -4.703507 -0.910844 0.383814
H  2.570338 1.138383 -0.363019
H  2.772881 0.379207 1.243155
H  -0.166016 -2.93061 1.48134
H  -1.080298 -3.753009 0.164202
H  0.655921 -3.391698 -0.05659
H  -0.8980 -0.832578 -2.200815
H  0.142928 -2.293083 -2.119552
H  -1.629856 -2.466946 -1.962363
H  4.371283 -0.387338 -1.313118
H  4.562153 -1.160408 0.287884
H  -4.572043 1.174525 -2.037429
H  -5.869444 -0.003996 -1.587473
H  -6.225342 1.754105 -1.667777
H  -7.091471 1.825958 0.585365
H  -6.85083 0.048926 0.719871
H  -6.15451 1.154487 1.966365
H  -4.225748 2.638909 1.374205
H  -3.610706 2.678599 -0.328218
H  -5.245375 3.303865 0.053733
H  7.573582 0.848435 -0.090165
H  6.908111 -0.796109 0.204928
H  6.720459 -0.020446 -1.414001
H  6.109159 2.752058 -0.404739
H  5.167237 1.922492 -1.690225
H  4.329235 2.615158 -0.245165
H  6.372648 1.664098 1.845611
H  4.588194 1.556398 1.971631
H  5.601945 0.07148 2.159481
