program: Gaussian 09
title: 000131493
version: EM64L-G09RevD.01
frameworkgroup: C1[X(C15H16N4)]
method: RPBEPBE
basis: SDD
operation: Freq
keyword: #pfreq=noraman
keyword: PBEPBE/SDD
title: #p freq=noraman PBEPBE/SDD
converged: YES YES NO NO
title: Mulliken charges:
elementType: N N N N C C C C C C C C C C C C C C C H H H H H H H H H H H H H H H H
charge: -0.286711 -0.293539 -0.033140 -0.096645 -0.245184 -0.397572 0.508072 0.338886 -0.690401 -0.410969 -0.394054 -0.023836 -0.326022 -0.228703 -0.241064 -0.277777 -0.238065 -0.191208 -0.218842 0.224286 0.187116 0.257294 0.295955 0.209906 0.220511 0.230616 0.229184 0.232646 0.261578 0.227747 0.227324 0.252221 0.231239 0.228154 0.230998
chargesum: 0.00000
title: Mulliken charges with hydrogens summed into heavy atoms:
elementType: N N N N C C C C C C C C C C C C C C C
charge: 0.009244 -0.293539 -0.033140 -0.096645 -0.020898 0.046837 0.508072 0.338886 -0.029368 -0.181785 -0.161408 -0.023836 -0.064445 -0.000956 -0.013740 -0.025556 -0.006826 0.036946 0.012156
polarizability: 2.53021904e+02 2.51904695e+00 1.95156375e+02 2.45668125e+01 -2.12349086e+01 1.12250624e+02
1716.lowfreq: -7.4251 -3.5006 -0.0004 0.0003 0.0004 3.9071 7.5295 15.9596 37.6936
frequency: 6.8722 15.8607 37.6863 55.0449 89.5007 110.6383 168.8447 184.6261 201.6736 220.2579 246.7236 256.5443 264.6202 323.1372 402.0860 411.9169 429.7151 442.8530 479.7595 516.9449 521.6968 559.4653 584.4654 597.0474 616.8519 619.6891 633.6154 704.0146 727.8097 749.4153 756.8480 767.6074 769.5913 785.1900 845.1137 854.8123 865.3589 880.3180 902.9600 907.1880 923.3841 951.6984 977.2467 985.2457 991.1527 996.5215 999.7808 1016.0049 1026.0153 1054.9991 1064.3870 1089.4519 1092.8306 1118.2455 1136.9545 1160.3992 1173.5863 1190.6689 1205.3842 1213.5267 1215.1504 1241.9874 1280.2198 1282.9447 1315.6858 1344.3497 1347.9075 1373.1301 1384.5841 1392.8790 1413.0653 1438.8324 1440.2829 1455.4925 1476.8117 1477.6737 1484.6400 1489.7210 1492.1739 1593.8897 1594.1373 1614.1280 1624.3746 2979.1066 2983.6727 3005.3496 3047.1280 3073.6400 3083.9825 3117.7605 3123.7236 3136.0964 3136.1803 3147.2287 3152.8655 3164.2385 3170.4956 3178.0933 3437.5842
redmass: 3.7386 4.9397 4.5626 4.9945 3.1108 3.3850 3.7008 1.4197 3.7044 5.8874 4.0397 2.0656 3.1165 4.3722 2.7996 3.3193 3.0013 5.2509 2.6802 4.6268 5.9029 3.8809 3.9855 2.8252 6.3864 4.8096 5.7484 1.7497 4.0885 1.8681 3.0300 1.4974 2.9643 2.4726 1.8446 1.3029 1.4126 8.1039 1.9293 4.0916 1.6471 1.3639 1.3963 1.3059 6.0667 1.3433 2.0102 4.0984 2.3487 1.8462 2.1492 1.9609 2.5383 1.8502 1.7346 1.5108 1.0559 1.1127 2.1111 2.7462 7.2959 1.3191 1.4825 1.3993 1.3034 1.3940 1.4175 2.9188 5.7927 1.2727 2.7727 4.0450 2.1762 1.7208 1.0647 1.0809 1.9864 1.2278 1.8764 6.0615 7.2591 6.1308 7.5710 1.0362 1.0670 1.0819 1.0967 1.0996 1.0998 1.0870 1.0861 1.0903 1.0871 1.0960 1.0903 1.1015 1.0957 1.0995 1.0755
irintensity: 0.0565 1.3488 1.0552 0.4323 1.7747 0.1661 0.8676 1.1403 1.8679 0.9990 0.2583 2.4639 3.7842 4.9154 0.1801 1.3485 5.3798 2.1849 2.4715 3.7599 4.6316 8.0750 13.1913 65.9735 0.1731 18.6267 3.6359 63.7489 5.3105 14.8211 15.1534 59.0464 42.9661 26.7328 12.4142 1.0767 0.4726 6.9737 34.0795 30.7916 2.0077 2.5205 0.0855 0.0257 0.7498 0.7344 10.9055 6.5004 4.7495 1.1482 6.1629 10.0271 10.2485 7.2442 1.3023 6.6514 0.1765 0.8019 6.5310 2.4018 39.1330 2.8822 0.9535 0.9012 6.2068 13.5934 18.9833 5.0447 0.4471 15.3998 12.0926 8.2344 7.5630 1.1371 6.2488 7.3520 12.9421 7.4671 13.2145 1.0030 1.5148 2.4581 10.7217 32.0754 11.1214 21.9858 2.8840 45.7580 43.7067 9.4328 1.3073 6.8054 9.7030 38.8927 11.6146 23.8416 12.1562 16.8192 4.7218
temp: 298.150 k
press: 1.00000 atm
elementType: 7 7 7 7 6 6 6 6 6 6 6 6 6 6 6 6 6 6 6 1 1 1 1 1 1 1 1 1 1 1 1 1 1 1 1
symmnumber: 1
zpe: 739250.6 jmol-1
zpe.correction: 0.281566 hartree
zpe.thermalcorrener: 0.298056 hartree
zpe.thermalcorrenthalpy: 0.299000 hartree
zpe.thermalcorrgfe: 0.233906 hartree
zpe.sumelectzpe: -798.785262 hartree
zpe.sumelectthermal: -798.768772 hartree
zpe.sumelectthermalent: -798.767828 hartree
zpe.sumelectthermalfe: -798.832922 hartree
dipole: -2.3502 -3.0391 0.8006
dipole: 3.9243
quadrupole: -102.6019 -111.6161 -112.3470
quadrupole: -9.9921 7.8893 -2.0409
quadrupole: 6.2531 -2.7611 -3.4920 -9.9921 7.8893 -2.0409
hfenergy: -799.0668281 hartree
pointgroup: C01 [X(C15H16N4)]
dipole: 0.9834582 -1.1858121 -0.1022713 debye
polarizability: 253.2051347|4.6800136|200.3425349|22.7570153|6.1134829|106.8812325 unknown
InChI: InChI=1S/C15H16N4/c1-2-13(12-8-4-3-5-9-12)17-19-15-11-7-6-10-14(15)16-18-19/h3-11,13,17H,2H2,1H3
charge 0 multiplicity 1
35 atoms
N  0.137459 0.378724 0.652198
N  -1.227615 0.598054 0.44666
N  -1.834824 1.911244 0.377679
N  -3.139333 1.735347 0.152124
C  1.044286 0.65743 -0.526317
C  1.120692 2.157287 -0.913151
C  2.389456 0.005469 -0.191846
C  -2.191671 -0.379982 0.243617
C  1.916292 2.397262 -2.214183
C  2.622092 -1.345262 -0.554928
C  3.400245 0.697732 0.522272
C  -3.405721 0.348478 0.052005
C  -2.143696 -1.792115 0.220792
C  3.832162 -1.990362 -0.21974
C  4.610824 0.054178 0.867441
C  -4.626552 -0.329593 -0.184299
C  4.831856 -1.291482 0.49697
C  -3.363598 -2.452624 -0.015236
C  -4.586979 -1.734808 -0.217917
H  0.592564 0.105399 -1.373656
H  1.5666 2.738195 -0.080963
H  0.088827 2.537113 -1.024041
H  0.454612 0.830315 1.522014
H  1.469647 1.840262 -3.059828
H  1.913257 3.469005 -2.48199
H  2.967568 2.072311 -2.115385
H  1.845677 -1.892756 -1.103782
H  3.254312 1.746906 0.804231
H  -1.206506 -2.330328 0.388153
H  3.996345 -3.032657 -0.515287
H  5.381351 0.603901 1.41969
H  -5.555556 0.229125 -0.331198
H  5.772231 -1.788677 0.759724
H  -3.383372 -3.54788 -0.041483
H  -5.508332 -2.298612 -0.39824
