program: Gaussian 09
title: 000131491
version: EM64L-G09RevD.01
frameworkgroup: C1[X(C24H28N2O4)]
method: RPBEPBE
basis: SDD
operation: Freq
keyword: #p
keyword: freq=noraman
keyword: PBEPBE/SDD
title: #p freq=noraman PBEPBE/SDD
converged: YES YES NO NO
title: Mulliken charges:
elementType: O O O O N N C C C C C C C C C C C C C C C C C C C C C C C C H H H H H H H H H H H H H H H H H H H H H H H H H H H H
charge: -0.455099 -0.311705 -0.312370 -0.439240 -0.101713 -0.184583 -0.377474 -0.375546 -0.411795 -0.413630 -0.372884 -0.126023 0.327079 -0.299795 0.220735 -0.314032 -0.532967 -0.402368 0.314543 0.265430 0.135736 0.433509 -0.385633 -0.528391 -0.374237 -0.455397 -0.238458 -0.421513 -0.237250 -0.238729 0.214814 0.189067 0.206989 0.190884 0.263282 0.211879 0.197782 0.225229 0.219968 0.218521 0.212157 0.215740 0.241350 0.247373 0.358642 0.243413 0.247965 0.251626 0.227321 0.246813 0.219361 0.255511 0.237692 0.224697 0.352695 0.237934 0.227890 0.227204
chargesum: 0.00000
title: Mulliken charges with hydrogens summed into heavy atoms:
elementType: O O O O N N C C C C C C C C C C C C C C C C C C C C C C C C
charge: -0.096457 -0.311705 -0.312370 -0.086545 -0.101713 -0.184583 0.026407 0.022326 0.063366 0.009381 0.065606 0.086133 0.327079 0.157295 0.220735 -0.066659 -0.289555 -0.154404 0.314543 0.265430 0.135736 0.433509 -0.134007 0.165105 -0.118726 -0.217706 -0.013760 -0.183579 -0.009360 -0.011525
polarizability: 3.93927276e+02 5.54130781e+00 2.66801256e+02 -4.20445304e+01 -1.22989136e+01 2.32631007e+02
1716.lowfreq: -4.2386 -0.0005 0.0004 0.0011 1.3833 5.5676 11.0686 13.5065 16.7737
frequency: 10.8102 13.4238 16.6497 35.8586 50.0976 62.5413 72.8631 76.9210 96.7833 101.6205 124.6647 136.0685 148.6366 154.8574 171.4071 184.5573 187.9847 208.3665 223.4030 259.8725 262.7421 266.7884 280.7587 306.5518 319.1939 322.3859 332.0120 356.8158 370.8055 389.3747 404.1455 419.9565 426.1089 432.2639 462.1366 467.9791 472.8832 477.2328 484.6085 491.6810 514.1059 524.7574 547.6903 572.5565 578.1695 611.0121 616.2829 624.7715 640.6003 698.0976 709.3514 720.9571 728.1176 741.8074 780.1512 781.4448 782.9032 806.2051 807.9678 845.7083 846.5902 852.4191 856.7456 867.0131 881.0169 891.6818 907.8113 917.0826 925.3332 950.3782 958.9790 962.1142 974.9667 981.3621 994.0595 1001.1484 1022.6440 1038.6429 1053.2922 1056.0848 1060.5206 1072.4826 1086.1023 1089.2260 1096.2102 1113.3302 1117.0401 1131.5563 1138.8703 1145.9084 1147.9743 1153.0747 1159.4953 1166.1634 1171.0338 1185.8398 1198.3729 1204.5932 1215.1537 1228.3037 1235.1769 1237.9196 1248.5436 1259.1882 1267.3173 1279.5139 1295.0855 1297.4624 1313.5706 1325.1477 1341.5918 1348.4390 1351.8227 1364.4203 1375.1492 1376.5589 1383.8194 1390.9717 1401.6709 1405.0876 1411.3806 1426.8092 1438.5935 1439.9786 1450.8913 1455.3861 1455.8126 1460.3385 1464.0314 1465.5226 1471.6074 1476.5819 1482.4430 1500.0842 1517.1116 1584.3163 1585.9136 1597.1907 1627.6583 1636.1155 2855.2968 2863.0255 2892.4439 2903.0627 2915.3331 2959.2779 2964.8529 2976.0589 3034.2418 3039.2728 3040.4413 3045.8682 3058.1641 3059.2676 3078.6842 3114.9104 3122.2441 3129.5527 3135.1172 3136.2314 3150.9016 3151.0840 3154.8825 3171.4696 3172.6937 3174.8671 3544.9643 3587.6595
redmass: 5.9399 4.8391 4.9108 5.5941 5.5242 4.8242 4.8375 3.6119 2.9685 3.7395 4.0026 4.1784 3.4291 1.5327 2.0837 4.0437 4.5865 6.5003 4.0484 3.8312 4.3101 2.0640 3.7233 3.6326 3.3862 1.1570 3.5771 3.9963 3.0121 3.2194 2.7226 2.9934 1.1507 3.4467 3.1783 3.3349 3.3997 4.1920 4.1972 3.1683 6.1678 5.6305 4.7512 3.2738 4.2586 3.2447 5.2883 3.4546 3.2941 3.4161 5.6509 5.9789 3.0791 1.3249 3.4567 1.6873 5.3096 1.8439 1.5547 1.7505 3.2465 1.6084 2.3896 1.5319 5.6175 1.6206 2.0922 3.8967 1.3745 2.3446 3.8812 1.3687 1.3733 4.2827 1.3310 2.5217 2.5816 2.1588 1.8667 2.1747 3.0127 2.0459 2.2908 2.2785 2.0172 1.6327 1.6708 1.7480 2.4051 2.3675 1.4730 1.3450 1.7241 1.4003 1.0809 1.2601 1.2896 1.2991 1.8036 1.7310 1.5487 1.9208 1.3416 1.6795 1.7696 1.3658 1.4773 1.7709 1.2837 1.2921 1.3881 1.6843 1.5294 1.4862 2.1945 2.0884 1.9364 1.5041 1.8050 2.9245 1.7150 5.4261 1.7632 2.5027 1.9602 1.1075 1.0688 1.1034 1.1687 1.1391 1.1030 1.0979 1.0593 3.1097 3.9429 7.1465 6.2961 5.6835 6.9826 7.0032 1.0712 1.0699 1.0689 1.0690 1.0701 1.0820 1.0305 1.0585 1.0903 1.0898 1.0909 1.0892 1.1053 1.1045 1.0912 1.1023 1.0861 1.0862 1.0918 1.0899 1.0944 1.0874 1.0956 1.0971 1.0962 1.0962 1.0654 1.0661
irintensity: 0.2135 0.3371 0.1946 0.0226 0.5174 0.1915 0.0388 1.2424 6.6621 1.5266 2.4799 5.1291 4.2001 1.4166 1.2058 1.1167 0.5705 0.7466 3.4172 4.0900 1.4328 2.4524 9.8892 20.0102 18.0557 131.9128 5.8629 6.3720 2.9345 1.9095 0.8371 13.1524 135.8229 10.6374 3.1646 14.8595 0.1450 4.6041 4.2264 9.8044 2.7843 0.7342 0.4184 11.4529 9.4132 3.4481 10.8720 3.0107 0.9328 19.4949 4.0299 22.4705 5.7922 0.9947 15.4698 81.4066 0.5849 70.1403 37.5007 20.9502 16.4185 1.0031 4.5951 1.6901 47.1917 5.6819 14.8856 26.0905 1.9201 4.2311 54.5586 2.3757 5.2451 59.7486 0.3928 95.6156 29.0945 64.8657 0.5856 13.2594 98.5182 4.2718 58.4307 18.6092 37.6775 25.6880 8.7579 262.0000 50.6621 29.4369 6.4151 29.5858 7.4824 9.5067 1.7966 13.1096 23.5731 24.7312 71.9921 138.0084 8.7888 52.4195 56.5993 22.5485 33.2714 34.2070 24.0967 6.7613 16.5530 13.8719 0.6294 1.3920 5.6056 3.2142 13.0441 26.4172 47.5920 8.5114 6.6574 36.1777 14.3058 32.2339 32.6644 9.4282 54.9381 3.7240 17.9187 39.1777 16.1963 3.6745 17.7881 8.1123 3.2294 245.3753 31.8032 81.6659 11.2672 5.7539 18.7377 3.6431 50.3664 88.2747 75.4010 87.4238 126.6837 34.6627 73.0121 27.3334 2.3549 52.4699 61.4270 25.4026 35.8849 27.7023 5.1002 22.1918 1.2482 1.0822 9.2623 13.0597 27.5299 12.1980 37.5735 32.5840 2.2296 7.0043 13.9662 45.3988
temp: 298.150 k
press: 1.00000 atm
elementType: 8 8 8 8 7 7 6 6 6 6 6 6 6 6 6 6 6 6 6 6 6 6 6 6 6 6 6 6 6 6 1 1 1 1 1 1 1 1 1 1 1 1 1 1 1 1 1 1 1 1 1 1 1 1 1 1 1 1
symmnumber: 1
zpe: 1246599.6 jmol-1
zpe.correction: 0.474805 hartree
zpe.thermalcorrener: 0.502683 hartree
zpe.thermalcorrenthalpy: 0.503627 hartree
zpe.thermalcorrgfe: 0.413597 hartree
zpe.sumelectzpe: -1339.487702 hartree
zpe.sumelectthermal: -1339.459824 hartree
zpe.sumelectthermalent: -1339.458880 hartree
zpe.sumelectthermalfe: -1339.548910 hartree
dipole: -0.6615 0.6845 0.1349
dipole: 0.9614
quadrupole: -165.0044 -185.0980 -173.2110
quadrupole: -18.4986 -6.1871 -5.9701
quadrupole: 9.4334 -10.6602 1.2268 -18.4986 -6.1871 -5.9701
hfenergy: -1339.9625068 hartree
pointgroup: C01 [X(C24H28N2O4)]
dipole: 0.2504591 -0.2811316 -0.0362096 debye
polarizability: 389.3009258|-16.2494746|255.3536381|47.8212261|18.1869725|248.7049744 unknown
InChI: InChI=1S/C24H28N2O4/c1-29-24-15-19(27)9-10-22(24)26-13-11-25(12-14-26)16-20(28)17-30-23-8-4-6-18-5-2-3-7-21(18)23/h2-10,15,20,27-28H,11-14,16-17H2,1H3
charge 0 multiplicity 1
58 atoms
O  -2.446487 -2.981395 -1.560274
O  -3.388852 -0.539448 -0.515653
O  5.879299 -1.700193 0.937997
O  8.159246 2.621436 0.919858
N  0.842779 -1.615624 -0.406906
N  3.501337 -0.467898 -0.219082
C  1.887148 -2.237693 0.44708
C  1.479697 -0.939538 -1.565354
C  2.886094 -1.179494 0.937054
C  2.47627 0.13451 -1.095562
C  -0.210697 -2.580352 -0.805369
C  -1.535084 -1.892354 -1.181412
C  4.677112 0.299979 0.051379
C  -2.11021 -1.085288 -0.015355
C  5.838495 -0.316085 0.620513
C  4.768863 1.689561 -0.245881
C  6.989366 0.434581 0.932214
C  5.927553 2.442123 0.030832
C  7.034766 1.817356 0.64171
C  -4.182284 0.210869 0.36818
C  -5.433937 0.676459 -0.179063
C  -6.312944 1.446859 0.674999
C  -3.817365 0.502974 1.687675
C  5.843455 -2.593105 -0.243258
C  -5.827767 0.400213 -1.527734
C  -5.919532 1.733049 2.02562
C  -4.697801 1.270691 2.512623
C  -7.562053 1.904809 0.139059
C  -7.052674 0.861484 -2.018769
C  -7.928163 1.618451 -1.178244
H  1.398843 -2.7056 1.321483
H  2.444582 -3.036622 -0.10524
H  0.700972 -0.455354 -2.181854
H  2.019126 -1.677062 -2.213022
H  3.685673 -1.659288 1.524027
H  2.350822 -0.4528 1.591159
H  1.909335 0.942168 -0.572884
H  2.970465 0.5757 -1.979832
H  0.096249 -3.225066 -1.663425
H  -0.413697 -3.256016 0.046587
H  -1.396133 -1.205261 -2.043614
H  -2.3052 -1.744865 0.854491
H  -1.419678 -0.271587 0.274134
H  3.90825 2.206128 -0.680772
H  -3.353072 -2.588464 -1.653489
H  7.839778 -0.094146 1.379684
H  5.977096 3.510176 -0.199314
H  -2.86719 0.155665 2.102137
H  5.8358 -3.617091 0.161241
H  4.937151 -2.403236 -0.846935
H  6.748771 -2.438367 -0.86086
H  -5.149734 -0.171938 -2.167254
H  -6.590388 2.318005 2.664582
H  -4.395978 1.490706 3.542416
H  8.868181 2.090081 1.359146
H  -8.229202 2.487174 0.785747
H  -7.346058 0.645448 -3.051951
H  -8.88629 1.973874 -1.573362
