program: Gaussian 09
title: 000010576
version: EM64L-G09RevD.01
frameworkgroup: C1[X(C19H28O2)]
method: RPBEPBE
basis: SDD
operation: Freq
keyword: #pfreq=noraman
keyword: PBEPBE/SDD
title: #p freq=noraman PBEPBE/SDD
converged: NO YES NO NO
title: Mulliken charges:
elementType: O O C C C C C C C C C C C C C C C C C C C H H H H H H H H H H H H H H H H H H H H H H H H H H H H
charge: -0.458618 -0.237276 0.391535 -0.207876 -0.110478 -0.068383 0.212230 -0.492787 -0.514445 -0.514573 -0.519485 -0.229785 -0.478891 -0.843955 -0.635869 0.536974 -0.797443 -0.468255 -0.541347 -0.577425 0.178200 0.213707 0.218190 0.217269 0.231159 0.216863 0.219860 0.225847 0.220303 0.196614 0.240876 0.201370 0.227599 0.231941 0.211636 0.239653 0.217751 0.217761 0.234732 0.217509 0.250230 0.206292 0.229887 0.222087 0.213570 0.330645 0.224718 0.243149 0.256734
chargesum: 0.00000
title: Mulliken charges with hydrogens summed into heavy atoms:
elementType: O O C C C C C C C C C C C C C C C C C C C
charge: -0.127973 -0.237276 0.391535 0.005830 0.107712 0.148886 0.212230 -0.044765 -0.068738 -0.097656 -0.077239 -0.002186 -0.035313 -0.168789 -0.183628 0.536974 -0.111034 -0.032599 -0.073481 -0.320691 0.178200
polarizability: 2.69315132e+02 4.99701405e+00 1.83138287e+02 1.06536028e+01 -1.09193262e-01 1.58431897e+02
1716.lowfreq: -15.8796 -9.9119 -0.0007 -0.0007 -0.0006 12.3193 31.5495 50.3608 82.7430
frequency: 31.3888 50.3118 82.7234 107.4188 134.6061 149.7599 167.3652 173.1350 199.6162 212.8965 219.0946 234.0922 255.2040 274.0952 280.2024 288.1975 318.7212 331.0727 347.8838 360.8695 368.7871 388.2402 399.1742 419.9739 452.7247 463.3714 470.5482 480.8754 510.9754 530.8398 544.0664 563.0272 589.0642 610.6247 639.4418 686.6969 710.9700 755.4504 783.4229 801.2739 816.3212 830.3175 842.4702 849.3095 866.9874 895.6345 903.0189 911.5100 927.5808 952.6563 961.6237 970.8082 974.1756 997.4342 1005.7317 1017.5562 1024.5841 1038.0439 1043.8617 1065.5196 1070.8090 1074.9187 1086.2987 1102.8161 1112.5834 1125.1250 1132.5136 1145.4273 1159.0748 1167.3059 1173.2641 1182.3025 1192.5697 1205.9479 1218.3350 1221.3538 1232.2976 1240.8825 1254.3569 1261.7052 1267.3446 1280.5248 1283.1719 1289.1610 1294.2459 1296.5798 1312.6823 1318.2570 1321.3705 1328.7657 1334.7914 1340.6189 1344.2503 1351.2174 1353.2031 1354.9191 1369.3073 1380.2793 1387.5346 1443.5439 1452.9649 1458.3820 1465.9696 1466.7918 1467.7578 1468.6556 1472.9158 1477.6238 1483.1433 1491.8157 1494.8664 1585.9143 1626.7056 2898.8895 2917.1273 2942.4405 2944.2229 2949.2021 2964.4101 2969.7563 2972.0307 2974.0563 2977.6938 2979.3537 2996.4440 2996.9235 3010.4456 3031.1092 3032.0517 3040.8254 3045.7783 3050.9439 3056.3641 3058.2591 3066.0481 3068.7766 3071.5970 3073.2802 3092.3468 3121.3591 3558.3648
redmass: 5.7929 3.2779 3.9422 3.2918 3.1004 3.2392 2.7894 2.5202 2.5515 1.3707 2.4410 2.3075 1.8386 1.7928 1.1401 1.8707 3.0928 2.3595 2.5096 2.6998 2.4765 3.2905 3.0569 3.1015 3.4034 3.3664 3.4860 3.0932 2.9707 2.4313 2.8964 3.1320 3.4975 4.0167 3.3052 2.5311 3.0973 2.2453 1.9069 2.0323 2.2082 1.8418 2.2836 2.0661 2.2910 1.4526 2.1400 1.8425 1.7204 1.7780 1.7460 2.2087 2.1789 1.9631 2.4932 2.0339 2.7713 1.7825 2.0522 2.0355 1.9942 1.5928 1.8897 2.0057 1.9088 1.7283 2.2947 1.8176 1.7412 2.0296 2.1868 1.9063 1.4162 1.4008 1.4374 1.3560 2.1527 1.4672 1.4217 1.4577 1.6317 1.3054 1.3467 1.4464 1.4474 1.3610 1.5140 1.4695 1.4668 1.3899 1.4586 1.5171 1.8035 2.2258 1.5816 1.5204 1.4543 1.2339 1.2115 1.0824 1.0902 1.0671 1.0670 1.0857 1.0890 1.0607 1.0849 1.0729 1.0555 1.0676 1.0824 9.9171 7.7391 1.0791 1.0801 1.0771 1.0711 1.0836 1.0654 1.0674 1.0380 1.0598 1.0368 1.0619 1.0598 1.0630 1.0631 1.0977 1.0955 1.0974 1.1027 1.0976 1.0975 1.0993 1.0950 1.0982 1.1034 1.0990 1.0988 1.0913 1.0658
irintensity: 2.3496 1.5922 0.8041 0.6982 0.3214 0.9754 0.2927 2.7150 1.2484 0.8581 1.1991 2.9013 4.6654 4.8184 106.0902 7.9729 3.8995 1.6534 2.6837 5.3154 0.5972 3.8403 0.9393 0.3827 6.1884 3.8051 8.9974 0.8553 0.4118 2.5560 0.7290 4.7536 1.5068 0.8624 1.7675 3.3845 6.4142 7.0384 4.2571 2.6830 0.1634 2.4641 2.8133 5.8529 10.6616 22.0597 27.5300 9.5532 5.7312 2.2713 1.4769 18.8433 0.8890 1.1937 2.5883 1.4399 2.5657 22.1052 4.4516 38.2465 18.7286 13.1446 2.1780 12.4982 6.5999 7.8188 3.7217 4.8666 4.1916 1.7956 20.6605 5.1438 20.5493 19.7631 16.2481 1.1090 2.3602 1.0870 4.2987 11.4553 46.3465 4.6789 3.3258 5.4001 4.1591 2.0026 0.9143 14.6629 2.9073 2.2551 0.9453 0.7643 9.0643 15.8921 1.4901 0.9665 5.9381 14.4556 30.6785 14.0324 15.0311 0.3921 14.0771 8.8068 5.7661 5.2738 6.8048 7.0873 10.2881 9.0495 7.6774 169.7334 201.0454 7.9422 8.8016 2.6983 27.7889 43.3422 41.0778 10.1192 23.8775 45.8538 42.0400 41.9885 18.6793 27.7139 41.5148 6.9477 79.9848 39.5469 3.9780 38.4477 31.0698 35.5414 21.9867 28.3406 68.2653 29.6895 25.1687 10.5759 2.5223
temp: 298.150 k
press: 1.00000 atm
elementType: 8 8 6 6 6 6 6 6 6 6 6 6 6 6 6 6 6 6 6 6 6 1 1 1 1 1 1 1 1 1 1 1 1 1 1 1 1 1 1 1 1 1 1 1 1 1 1 1 1
symmnumber: 1
zpe: 1127890.8 jmol-1
zpe.correction: 0.429591 hartree
zpe.thermalcorrener: 0.449202 hartree
zpe.thermalcorrenthalpy: 0.450146 hartree
zpe.thermalcorrgfe: 0.383575 hartree
zpe.sumelectzpe: -889.645302 hartree
zpe.sumelectthermal: -889.625691 hartree
zpe.sumelectthermalent: -889.624747 hartree
zpe.sumelectthermalfe: -889.691318 hartree
dipole: 5.9294 1.3438 1.3377
dipole: 6.2252
quadrupole: -161.5769 -125.3837 -126.7348
quadrupole: 6.3991 -13.2947 0.5813
quadrupole: -23.6784 12.5148 11.1637 6.3991 -13.2947 0.5813
hfenergy: -890.0748928 hartree
pointgroup: C01 [X(C19H28O2)]
dipole: 2.3335421 -0.5310423 -0.5207036 debye
polarizability: 269.3725795|-5.1474921|183.1649895|-10.2442196|0.0735376|158.347747 unknown
InChI: InChI=1S/C19H28O2/c1-18-9-7-15-14-6-4-13(20)11-12(14)3-5-16(15)17(18)8-10-19(18,2)21/h11,14-17,21H,3-10H2,1-2H3
charge 0 multiplicity 1
49 atoms
O  4.531426 1.463925 0.649805
O  -5.964179 0.135085 0.828283
C  2.611763 0.379105 -0.450149
C  1.796193 -0.926465 -0.173447
C  0.306079 -0.85005 -0.604147
C  -0.426932 0.3910 -0.02667
C  3.906206 0.139622 0.411147
C  1.830797 1.610106 0.108865
C  2.046348 -1.245463 1.33882
C  0.364541 1.676651 -0.37441
C  3.365144 -0.50516 1.726358
C  -1.915207 0.477333 -0.51789
C  -0.453129 -2.148942 -0.25445
C  2.925762 0.598023 -1.9466
C  -1.902121 -2.102166 -0.794746
C  -2.648318 -0.855204 -0.358838
C  4.949373 -0.778129 -0.262324
C  -2.670488 1.633093 0.191196
C  -4.194685 1.592824 -0.042704
C  -3.937236 -0.935784 0.106187
C  -4.788336 0.243721 0.361422
H  2.251147 -1.744329 -0.772724
H  0.290671 -0.747809 -1.713971
H  -0.45786 0.29081 1.081331
H  2.370775 2.531839 -0.171951
H  1.832665 1.584407 1.215215
H  2.122952 -2.334761 1.504088
H  1.207719 -0.889591 1.964332
H  -0.113506 2.560348 0.088033
H  0.321101 1.83709 -1.472228
H  3.166276 0.298843 2.457558
H  4.107472 -1.187479 2.180286
H  -1.875426 0.696607 -1.611911
H  -0.473519 -2.28785 0.844276
H  0.074095 -3.024767 -0.68202
H  3.678021 1.399757 -2.062551
H  3.316952 -0.318224 -2.425858
H  2.025034 0.902055 -2.508696
H  -2.46607 -3.006773 -0.502065
H  -1.85269 -2.102683 -1.906072
H  5.340087 -0.325617 -1.189346
H  5.802603 -0.945979 0.42433
H  4.527904 -1.770218 -0.506196
H  -2.274286 2.606918 -0.147784
H  -2.471146 1.565542 1.280133
H  5.392074 1.322443 1.119502
H  -4.416803 1.747444 -1.11972
H  -4.716793 2.392198 0.511665
H  -4.418049 -1.912143 0.250536
