program: Gaussian 09
title: 000131490
version: EM64L-G09RevD.01
frameworkgroup: C1[X(C23H26N2O3)]
method: RPBEPBE
basis: SDD
operation: Freq
keyword: #p
keyword: freq=noraman
keyword: PBEPBE/SDD
title: #p freq=noraman PBEPBE/SDD
converged: YES YES NO NO
title: Mulliken charges:
elementType: O O O N N C C C C C C C C C C C C C C C C C C C C C C C H H H H H H H H H H H H H H H H H H H H H H H H H H
charge: -0.454949 -0.308198 -0.465119 -0.106982 -0.163086 -0.368313 -0.372755 -0.392163 -0.411620 -0.370847 -0.123915 0.338043 -0.302325 0.173373 -0.344778 -0.379761 -0.264351 0.264472 -0.236104 0.134020 0.434263 -0.384998 -0.375296 -0.456095 -0.238535 -0.421906 -0.237366 -0.238952 0.203247 0.203235 0.208048 0.193052 0.199804 0.262829 0.222352 0.198981 0.211491 0.223700 0.211880 0.213528 0.244561 0.245642 0.357365 0.209057 0.221759 0.226054 0.356425 0.250623 0.257758 0.237175 0.223806 0.237489 0.227632 0.226752
chargesum: 0.00000
title: Mulliken charges with hydrogens summed into heavy atoms:
elementType: O O O N N C C C C C C C C C C C C C C C C C C C C C C C
charge: -0.097584 -0.308198 -0.108694 -0.106982 -0.163086 0.038169 0.028346 0.070471 0.009713 0.064344 0.087965 0.338043 0.155763 0.173373 -0.099135 -0.170704 -0.042592 0.264472 -0.010051 0.134020 0.434263 -0.134376 -0.117538 -0.218919 -0.014729 -0.184417 -0.009734 -0.012200
polarizability: 3.62060651e+02 1.85560218e+01 2.45374131e+02 2.48037783e+01 4.50692093e+01 2.37250731e+02
1716.lowfreq: -9.7549 -1.7925 -0.0010 -0.0007 0.0005 6.3395 10.6268 12.3789 20.1208
frequency: 9.3220 11.6339 19.6191 37.5074 53.8730 69.0102 73.5835 81.6366 114.1273 123.5163 146.0554 154.0096 183.5094 197.8473 214.9838 228.5873 252.2583 262.5353 263.8598 285.2569 313.9121 323.4266 347.4446 353.7529 368.1786 391.2588 419.1826 422.2879 429.1546 461.1428 462.7924 471.6345 474.4808 476.9323 499.8168 517.4112 534.2239 544.1827 558.8978 571.1028 572.4023 614.2362 628.5323 640.1834 700.5238 717.8419 720.3590 737.7918 741.3176 779.3756 780.9036 782.1544 800.0966 805.8214 821.5117 846.3300 850.9960 855.9799 866.6667 891.1615 896.5511 907.5417 922.6309 948.9176 954.8618 958.4458 961.5738 974.3570 993.7310 1003.6817 1022.6546 1037.7886 1048.4184 1052.0797 1058.8127 1060.1781 1071.9065 1082.3620 1086.5790 1090.1463 1111.0708 1143.0238 1143.5186 1147.8576 1155.1605 1165.3407 1171.3360 1174.2268 1185.2192 1200.1377 1206.7978 1227.3018 1228.7032 1235.6895 1239.1765 1245.2837 1253.5458 1267.4604 1282.3420 1297.0077 1306.3951 1310.5891 1327.1744 1344.5983 1352.6615 1360.2325 1365.2748 1375.5275 1383.8583 1391.5157 1397.8563 1401.9705 1404.9001 1425.9088 1440.0448 1440.5893 1449.9145 1454.6869 1458.7629 1462.2335 1464.3411 1467.0949 1475.8731 1507.6875 1516.4968 1583.4100 1587.0355 1596.5769 1616.0809 1635.7513 2867.6050 2878.3721 2894.6992 2906.7907 2915.4135 2963.9540 2974.5152 3029.5177 3035.8337 3042.5559 3047.1977 3056.2738 3102.5178 3103.5708 3121.6249 3129.0836 3133.7408 3135.7024 3150.7521 3154.8449 3155.4680 3169.5903 3172.1265 3173.3173 3548.1216 3576.6861
redmass: 4.9909 5.8803 4.4242 5.2235 5.4057 5.0186 4.2794 4.0891 3.5563 4.0307 4.6775 4.3388 4.0419 4.1090 5.0763 4.3981 3.8272 4.0699 2.1556 2.9743 3.3225 2.7860 1.2595 3.1118 3.8664 2.1898 2.4982 1.2740 3.1540 3.1235 3.1637 3.3257 3.7070 3.3862 3.9508 5.4727 6.1930 4.6435 3.8976 4.3172 3.4317 6.0509 2.6838 3.2822 3.4837 3.9194 6.0004 1.2615 1.3249 3.7862 1.7010 5.0445 5.2642 1.8641 1.4663 4.0065 1.5699 2.3361 1.5535 1.6240 1.3926 1.9723 4.1354 1.8061 1.6184 3.7359 1.3664 1.3761 1.3296 2.4543 2.6020 2.2317 2.1469 1.8240 2.2459 2.9786 2.1033 2.1894 2.2370 2.0988 2.4093 2.3446 2.2848 1.4613 1.4744 1.5172 1.0794 1.1638 1.2561 1.2674 1.3791 1.9514 2.0739 1.8125 1.6208 1.4615 1.2536 1.7614 1.3888 1.3988 1.5212 1.2881 1.2892 1.3078 1.3823 1.6678 1.4824 2.1016 1.6230 1.4806 3.6564 1.9055 2.7868 5.6197 2.4604 2.5702 1.9733 1.1131 1.1046 1.0997 1.2095 1.0984 1.0964 2.8493 3.9181 7.1258 6.2909 5.6805 6.5664 6.9695 1.0704 1.0700 1.0687 1.0688 1.0708 1.0787 1.0614 1.0909 1.0910 1.0902 1.0902 1.1055 1.0891 1.0900 1.0862 1.0860 1.0865 1.0900 1.0947 1.0958 1.0923 1.0996 1.0962 1.0965 1.0655 1.0659
irintensity: 0.0847 0.0707 0.1457 0.0725 1.0009 0.3767 0.4098 2.8633 2.5114 0.2762 0.2537 8.3639 0.5658 1.8979 3.4729 2.7454 7.3557 1.7789 3.0858 12.2223 4.8205 3.3885 111.0555 9.1577 13.1141 1.9659 34.8301 106.2494 17.0037 3.8144 7.3876 0.9465 1.9586 11.6349 3.4607 3.7031 1.3443 0.1967 1.3988 4.5838 7.9319 6.7680 0.5509 0.8633 5.1025 2.1285 23.4630 106.4866 1.3592 22.1330 83.9282 2.0041 12.1537 68.7204 0.4579 4.2532 1.4674 5.6215 1.6977 5.3931 1.7974 19.9729 41.0582 2.8034 1.8640 51.7130 2.3516 5.6954 0.1666 86.9560 28.4808 53.5289 38.0022 8.5407 19.6740 92.3575 1.1741 44.8587 91.3026 6.4870 25.8496 59.7451 29.5473 3.9828 94.1419 8.6813 2.2571 0.1404 11.0724 0.5229 16.7718 114.4261 48.4803 43.6934 15.8823 180.4588 7.5583 32.1928 52.2984 33.2585 9.0179 20.1728 18.7889 7.1859 1.8103 9.4426 1.8805 24.4887 44.7475 13.1598 8.2919 5.6062 35.7707 33.5116 14.3693 17.4957 51.5117 2.8539 12.8501 38.6384 1.7649 10.9586 9.5513 142.0852 30.9960 81.4835 7.3074 5.5516 81.8384 3.6700 61.8505 46.7418 67.0677 88.6197 150.1460 25.6881 30.7462 13.3717 55.9499 58.1727 24.4239 34.9631 19.2025 5.5612 1.3239 1.4175 8.4441 13.9447 29.0792 38.5242 27.2430 16.3048 30.1801 3.1244 10.8303 23.8383
temp: 298.150 k
press: 1.00000 atm
elementType: 8 8 8 7 7 6 6 6 6 6 6 6 6 6 6 6 6 6 6 6 6 6 6 6 6 6 6 6 1 1 1 1 1 1 1 1 1 1 1 1 1 1 1 1 1 1 1 1 1 1 1 1 1 1
symmnumber: 1
zpe: 1165380.9 jmol-1
zpe.correction: 0.443870 hartree
zpe.thermalcorrener: 0.468895 hartree
zpe.thermalcorrenthalpy: 0.469839 hartree
zpe.thermalcorrgfe: 0.385765 hartree
zpe.sumelectzpe: -1225.140434 hartree
zpe.sumelectthermal: -1225.115409 hartree
zpe.sumelectthermalent: -1225.114465 hartree
zpe.sumelectthermalfe: -1225.198539 hartree
dipole: -1.5029 -1.1253 0.4997
dipole: 1.9429
quadrupole: -151.7898 -170.3090 -152.1577
quadrupole: -5.2656 -4.1808 10.8843
quadrupole: 6.2957 -12.2235 5.9278 -5.2656 -4.1808 10.8843
hfenergy: -1225.5843038 hartree
pointgroup: C01 [X(C23H26N2O3)]
dipole: 0.6077249 0.433486 -0.1644896 debye
polarizability: 359.4542767|-10.5426227|197.6994257|-33.5738445|-7.8160301|287.5318101 unknown
InChI: InChI=1S/C23H26N2O3/c26-19(17-28-23-11-5-7-18-6-1-2-8-20(18)23)16-24-12-14-25(15-13-24)21-9-3-4-10-22(21)27/h1-11,19,26-27H,12-17H2
charge 0 multiplicity 1
54 atoms
O  -1.872989 -2.967199 1.744833
O  -2.874637 -0.598966 0.510832
O  5.626435 0.48885 1.941418
N  1.335016 -1.677933 0.312024
N  3.953544 -0.506948 -0.116072
C  2.029643 -0.936311 1.398309
C  2.340819 -2.331693 -0.561144
C  2.977406 0.119934 0.812642
C  3.291617 -1.29023 -1.177338
C  0.312776 -2.626115 0.816871
C  -1.000591 -1.918437 1.197037
C  5.153714 0.178342 -0.432058
C  -1.652353 -1.245117 -0.01143
C  6.018562 0.683829 0.594738
C  5.600004 0.341573 -1.776022
C  7.232803 1.326713 0.280769
C  6.828399 0.96393 -2.090212
C  -3.71038 0.071258 -0.397183
C  7.651879 1.468175 -1.062388
C  -4.880584 0.683358 0.185582
C  -5.797368 1.384131 -0.688522
C  -3.458461 0.158925 -1.771589
C  -5.15609 0.620295 1.589288
C  -5.521399 1.457356 -2.095471
C  -4.375602 0.858268 -2.616915
C  -6.963273 1.991438 -0.114696
C  -6.301572 1.224078 2.11631
C  -7.213788 1.914026 1.257376
H  2.616041 -1.63319 2.047463
H  1.281184 -0.42779 2.032286
H  1.814526 -2.862787 -1.376074
H  2.951506 -3.080374 0.003474
H  2.374397 0.883625 0.268803
H  3.525572 0.612773 1.628154
H  4.058924 -1.822312 -1.767283
H  2.709156 -0.635269 -1.868848
H  0.086395 -3.363487 0.023654
H  0.659288 -3.203546 1.706494
H  -0.818509 -1.140576 1.969011
H  -1.930862 -2.00323 -0.771526
H  -0.969143 -0.495081 -0.451665
H  4.964516 -0.010242 -2.59395
H  -2.773426 -2.569317 1.86909
H  7.867818 1.701339 1.095946
H  7.129168 1.064868 -3.138627
H  8.601857 1.96101 -1.291931
H  6.337076 0.813191 2.548654
H  -2.568933 -0.29785 -2.213145
H  -4.450212 0.097221 2.24053
H  -6.220509 1.990064 -2.749684
H  -4.163244 0.915994 -3.690056
H  -7.658659 2.522002 -0.776098
H  -6.503736 1.172175 3.191784
H  -8.108721 2.383056 1.681158
