program: Gaussian 09
title: 000131489
version: EM64L-G09RevD.01
frameworkgroup: C1[X(C9H14ClN2O14P3)]
method: RPBEPBE
basis: SDD
operation: Freq
keyword: #p
keyword: freq=noraman
keyword: PBEPBE/SDD
title: #p freq=noraman PBEPBE/SDD
converged: NO YES NO NO
title: Mulliken charges:
elementType: Cl P P P O O O O O O O O O O O O O O N N C C C C C C C C C H H H H H H H H H H H H H H
charge: 0.012454 1.496015 1.467930 1.427155 -0.315335 -0.440256 -0.481056 -0.270419 -0.701854 -0.674011 -0.684714 -0.216578 -0.714031 -0.778563 -0.511384 -0.622846 -0.631819 -0.656970 -0.206455 -0.407426 -0.150603 -0.012454 -0.544125 0.071706 -0.355261 0.235810 -0.015193 -0.253819 0.208421 0.234373 0.294448 0.312518 0.237350 0.280230 0.261780 0.258168 0.352782 0.340119 0.367008 0.462103 0.456568 0.419061 0.449172
chargesum: 0.00000
title: Mulliken charges with hydrogens summed into heavy atoms:
elementType: Cl P P P O O O O O O O O O O O O O O N N C C C C C C C C C
charge: 0.012454 1.496015 1.467930 1.427155 -0.315335 -0.087474 -0.481056 -0.270419 -0.701854 -0.211908 -0.684714 -0.216578 -0.714031 -0.321995 -0.511384 -0.203785 -0.182646 -0.656970 -0.206455 -0.040417 0.083771 0.281993 0.005743 0.351936 0.164687 0.235810 0.324926 -0.253819 0.208421
polarizability: 2.94669311e+02 3.09286547e+01 2.53027734e+02 -1.71078739e+00 -2.11083352e+00 1.68216182e+02
1716.lowfreq: -8.8788 -3.1747 -0.0009 0.0013 0.0016 7.7750 13.9055 18.7800 29.4261
frequency: 12.7761 18.6358 29.4147 35.1336 45.0530 63.4067 64.3035 68.9314 84.9563 98.3455 100.5560 117.4672 129.4227 140.6172 151.2321 155.5647 177.6005 181.8387 193.0300 203.3369 205.9896 219.5461 222.5236 241.9110 262.1935 268.3517 281.1028 286.0572 301.2530 311.0463 312.2913 320.9056 326.5884 337.3711 342.5638 347.6197 354.1974 362.1598 391.3502 404.6772 406.2207 417.3221 419.7306 444.0584 466.4787 511.1517 535.7489 543.9833 568.8473 586.8843 618.3324 654.7515 664.1133 678.0436 689.1420 691.0345 702.1092 710.8290 714.1803 730.7161 750.0231 761.7597 773.1774 775.0027 823.0677 832.8514 841.5763 873.0683 893.0140 925.9833 926.2691 940.6396 947.0425 962.1235 994.6829 998.4096 1016.5554 1029.5362 1037.4418 1061.0630 1063.6452 1069.0620 1100.9409 1103.2720 1114.4545 1150.8192 1152.6483 1183.1144 1195.8757 1239.3396 1242.0913 1255.5115 1266.2424 1285.5988 1302.9112 1312.6817 1317.9750 1322.8990 1326.0488 1357.1569 1366.0930 1370.0036 1385.9800 1391.3900 1447.5090 1460.0260 1602.8351 1637.8430 1657.2568 2567.9251 2652.6698 2984.7454 3017.5160 3031.9382 3036.4338 3066.3436 3114.9921 3122.6488 3192.8633 3247.9274 3521.4045 3570.2454 3591.6876
redmass: 11.0071 13.6105 12.8469 9.8866 9.1140 11.3380 9.4034 10.0209 10.6272 10.8160 5.0406 8.5076 7.5999 9.6649 5.5308 6.2041 7.0736 8.2650 8.4896 5.8757 7.1011 8.7044 4.2858 6.1370 7.2788 6.1691 10.5871 4.9857 2.5489 5.4085 2.2475 5.5368 9.5273 2.1144 7.8084 7.3607 9.8449 8.6315 8.4620 7.6048 6.4937 4.1478 8.5679 10.0638 3.3031 3.2166 15.2352 3.6517 7.9496 6.1221 5.4871 1.8059 6.9637 4.0641 7.5792 2.3688 4.4154 10.7387 5.1119 9.6331 8.1597 10.5862 2.8933 5.5798 3.8795 5.0153 3.8111 3.1045 1.3285 1.2683 2.9656 5.1002 1.3681 2.5067 3.3023 2.2406 4.2668 4.0979 3.7444 2.0686 1.7457 2.9712 4.8476 2.6654 5.4245 1.3051 1.5848 3.8652 1.3824 1.2830 1.1374 1.6217 1.4926 1.5202 1.1257 1.5458 1.1528 1.9242 1.2732 1.5938 1.6133 1.3205 2.3469 1.8356 1.0873 1.0944 6.1718 12.0256 6.1962 1.0770 1.0748 1.0852 1.0854 1.0594 1.0659 1.0868 1.1079 1.1010 1.0947 1.0651 1.0770 1.0663 1.0667
irintensity: 1.2419 0.2243 0.6405 1.0550 0.3445 1.4200 1.4621 0.2545 0.2767 0.1787 1.7411 2.4302 7.9124 4.9311 11.4818 2.6071 1.2149 3.7701 1.5282 10.3818 14.6716 5.8398 15.2714 12.4970 8.8315 3.4494 9.5648 1.6694 60.9967 13.8164 97.0441 13.9264 21.2215 85.3079 96.2390 4.4610 8.0639 61.3505 108.9800 7.8618 5.5959 16.2526 42.8028 3.4955 6.6467 28.2935 65.8425 10.1706 13.5525 7.6705 3.7687 67.2647 23.0339 88.6498 368.2611 28.0902 43.8317 0.9629 2.2570 120.6121 4.4832 172.3412 208.1276 174.4156 11.6845 222.7933 26.4887 30.9623 363.8563 226.3672 80.2913 171.9658 56.9426 13.7734 84.3460 66.2151 68.7838 122.5587 133.5812 7.6770 196.4247 133.0447 250.4310 38.8706 23.4227 181.5285 20.9771 13.4442 28.4392 2.4755 1.4815 122.6042 109.0255 28.1234 114.1791 43.5130 274.5884 41.3535 4.4053 27.0847 2.9506 2.6741 34.3232 40.7464 10.5149 20.3956 85.6900 284.8055 685.6729 891.4247 1495.5510 37.8044 9.6502 13.7091 20.8834 7.1736 4.3124 6.7341 62.9518 249.8434 71.4262 13.3021 164.0092
temp: 298.150 k
press: 1.00000 atm
elementType: 17 15 15 15 8 8 8 8 8 8 8 8 8 8 8 8 8 8 7 7 6 6 6 6 6 6 6 6 6 1 1 1 1 1 1 1 1 1 1 1 1 1 1
symmnumber: 1
zpe: 714702.0 jmol-1
zpe.correction: 0.272216 hartree
zpe.thermalcorrener: 0.303153 hartree
zpe.thermalcorrenthalpy: 0.304098 hartree
zpe.thermalcorrgfe: 0.208359 hartree
zpe.sumelectzpe: -2995.509068 hartree
zpe.sumelectthermal: -2995.478130 hartree
zpe.sumelectthermalent: -2995.477186 hartree
zpe.sumelectthermalfe: -2995.572925 hartree
dipole: -4.5402 -4.4003 -1.5384
dipole: 6.5071
quadrupole: -179.5362 -215.4549 -210.9800
quadrupole: 36.9214 9.1023 7.5025
quadrupole: 22.4542 -13.4645 -8.9896 36.9214 9.1023 7.5025
hfenergy: -2995.7812833 hartree
pointgroup: C01 [X(C9H14Cl1N2O14P3)]
dipole: -0.9905176 -2.2353831 -0.7589982 debye
polarizability: 267.9579549|37.310491|276.8512415|16.6933435|2.3982518|171.1040298 unknown
InChI: InChI=1S/C9H14ClN2O14P3/c10-4-2-12(9(15)11-8(4)14)7-1-5(13)6(24-7)3-23-28(19,20)26-29(21,22)25-27(16,17)18/h2,5-7,11,13,16-17,19,21H,1,3H2
charge 0 multiplicity 1
43 atoms
Cl -0.319197 3.119897 -0.175327
P  1.616546 -1.107453 0.304074
P  4.342489 0.155036 -0.269811
P  3.482345 2.410493 1.705124
O  -1.479923 -1.786226 0.738655
O  -3.261485 -4.451337 0.733315
O  1.23402 -2.735585 0.518456
O  -5.053057 -0.359026 -0.965324
O  3.345336 -1.220713 0.157525
O  1.063115 -0.721037 -1.257979
O  1.190844 -0.075773 1.439324
O  -3.036327 3.820874 -1.595074
O  4.490284 1.024948 1.227297
O  3.130633 1.040068 -1.126732
O  5.69456 -0.241363 -0.954928
O  4.436428 3.273097 2.789684
O  2.328374 1.79335 2.714691
O  3.096672 3.165855 0.336541
N  -2.833497 -0.076846 -0.23451
N  -3.987833 1.711859 -1.252105
C  -2.40764 -3.799797 -0.26845
C  -1.202744 -3.235236 0.52544
C  -3.069915 -2.541565 -0.873004
C  -2.828099 -1.492605 0.232062
C  0.113509 -3.374174 -0.239714
C  -4.036316 0.378933 -0.828649
C  -1.751077 0.773431 -0.010334
C  -1.757058 2.073794 -0.44892
C  -2.912215 2.654993 -1.140005
H  -2.09919 -4.522696 -1.050877
H  -1.142873 -3.719655 1.514541
H  -4.139542 -2.671142 -1.09286
H  -2.549239 -2.233229 -1.797952
H  -3.567206 -1.597894 1.048759
H  0.058207 -2.930035 -1.249284
H  0.423113 -4.430454 -0.294503
H  -4.093978 -4.772241 0.30287
H  -0.911638 0.346402 0.540213
H  -4.841532 2.064236 -1.697993
H  1.591464 0.064871 -1.616766
H  3.051725 2.039183 -0.821278
H  5.068944 3.916037 2.376838
H  1.779476 0.999126 2.300469
