program: Gaussian 09
title: 000131487
version: EM64L-G09RevD.01
frameworkgroup: C1[X(C13H20FNO4)]
method: RPBEPBE
basis: SDD
operation: Freq
keyword: #p
keyword: freq=noraman
keyword: PBEPBE/SDD
title: #p freq=noraman PBEPBE/SDD
converged: YES YES NO NO
title: Mulliken charges:
elementType: F O O O O N C C C C C C C C C C C C C H H H H H H H H H H H H H H H H H H H H
charge: -0.193781 -0.448833 -0.296158 -0.432663 -0.483323 -0.345142 0.270556 -0.426411 -0.138084 -0.694106 -0.683999 -0.725483 -0.305789 0.276397 -0.405825 0.167515 0.155457 -0.451082 0.187548 0.241875 0.227296 0.232134 0.213186 0.205103 0.210454 0.227652 0.204931 0.224077 0.214793 0.231102 0.210768 0.201859 0.239750 0.232186 0.357723 0.284657 0.251331 0.386560 0.375768
chargesum: 0.00000
title: Mulliken charges with hydrogens summed into heavy atoms:
elementType: F O O O O N C C C C C C C C C C C C C
charge: -0.193781 -0.091110 -0.296158 -0.046102 -0.107555 -0.103267 0.270556 0.033019 0.075102 -0.050897 -0.040197 -0.081754 0.166147 0.276397 -0.121169 0.167515 0.155457 -0.199751 0.187548
polarizability: 2.04767820e+02 2.24666099e+01 1.42333573e+02 -1.00817575e+01 1.25281183e+01 1.49978275e+02
1716.lowfreq: -9.2472 -0.0001 0.0006 0.0009 2.8272 7.8611 12.9092 18.7982 30.3312
frequency: 12.7238 18.4946 30.0949 49.6350 85.4873 94.7498 112.7158 139.9359 161.4018 173.5233 188.4674 204.1744 217.0000 243.7898 254.4712 259.8706 272.3716 277.9716 283.5907 298.1096 331.5183 352.6222 367.5925 383.6783 402.0720 433.6739 436.2400 437.8662 452.7437 465.8360 477.8389 482.9100 509.1949 584.9806 622.2472 650.1639 667.5428 686.8737 688.3818 739.5755 747.9176 804.7800 837.5979 837.8810 848.3887 886.0619 900.5120 916.2245 922.8380 938.3746 945.2847 997.0682 1015.4562 1027.6339 1061.6595 1078.2286 1100.9774 1106.6192 1114.9732 1157.1417 1175.7713 1180.5136 1207.6937 1212.5350 1227.3581 1240.0134 1243.6392 1273.8798 1275.9712 1327.7125 1340.2369 1353.4060 1358.8997 1367.3375 1372.5107 1377.7079 1394.2352 1399.3237 1442.3136 1447.8067 1454.7620 1459.5291 1462.4472 1464.1153 1474.9935 1484.7232 1487.5025 1495.5391 1518.1741 1613.1734 1644.8706 2934.8463 2967.1938 2971.1663 2983.1350 2983.7402 3029.5056 3058.4803 3060.5686 3061.2002 3067.7740 3069.9193 3078.6765 3086.4110 3092.9286 3156.9122 3188.0000 3411.1033 3527.1553 3528.8798 3630.4184
redmass: 4.6650 6.8403 2.9107 4.6925 5.6150 3.6377 4.7368 6.1081 3.4131 1.3756 3.0027 1.4790 1.8700 1.5893 1.4099 1.1207 5.7723 5.3893 5.8700 3.1134 2.3392 5.1766 2.5036 8.2660 2.3607 5.6836 2.7635 2.4623 1.2049 3.1727 1.1272 3.3364 3.7420 4.3926 3.8665 10.0359 1.6349 6.3165 2.5646 3.2820 5.4618 1.6735 2.0634 2.2864 2.9611 1.9898 1.8226 2.4415 1.6801 1.2088 3.2611 1.7663 1.4093 1.5381 3.6939 2.0710 3.3786 2.0893 1.9582 1.4881 1.2695 2.2327 1.5420 2.3908 1.5345 1.9942 1.5096 2.1996 1.9134 1.3369 1.8087 1.8625 1.6409 1.2341 1.2544 1.3578 1.2118 6.5948 1.9892 1.1209 1.0972 1.4513 1.0527 1.0553 1.0624 1.0721 1.1225 1.0621 3.7934 7.9635 7.6025 1.0687 1.0355 1.0366 1.0550 1.0357 1.0852 1.0966 1.1047 1.0985 1.0982 1.0993 1.0982 1.1004 1.0996 1.0927 1.0915 1.0738 1.0652 1.0650 1.0668
irintensity: 0.4182 0.2576 0.1253 0.9620 0.0670 2.5644 1.7293 0.4648 9.4043 1.9461 21.7586 144.5539 6.0386 2.0384 1.6098 0.4758 9.1589 1.2705 0.4550 4.1497 1.1689 11.5546 1.2724 2.3621 2.4732 1.5058 29.9201 6.2327 170.3503 10.8621 124.7298 11.8900 15.5787 1.9568 36.9737 0.7954 72.7452 17.8349 1.4916 1.9026 0.4125 18.4739 68.6232 71.9923 23.9276 7.5671 5.0500 49.1342 8.8369 0.1801 47.8158 26.4932 2.5377 38.0426 29.3346 34.5333 29.6520 235.1937 21.6884 250.7277 50.2786 48.5343 94.0565 59.1654 16.0308 35.6619 31.4694 11.1214 117.8368 3.7092 21.3751 8.8723 16.7635 14.8325 26.3749 50.5237 17.9576 24.8541 224.8376 10.9969 6.1946 0.5527 0.4091 1.0071 7.6413 6.0395 7.8046 25.0698 260.0040 15.2912 7.7863 60.6794 31.2062 42.7870 23.3626 11.5459 25.2070 12.6554 24.6824 5.2856 66.0963 20.1800 62.1159 7.4368 72.4082 1.8474 0.6211 2.5375 19.0186 84.7666 67.1496
temp: 298.150 k
press: 1.00000 atm
elementType: 9 8 8 8 8 7 6 6 6 6 6 6 6 6 6 6 6 6 6 1 1 1 1 1 1 1 1 1 1 1 1 1 1 1 1 1 1 1 1
symmnumber: 1
zpe: 828201.4 jmol-1
zpe.correction: 0.315445 hartree
zpe.thermalcorrener: 0.336673 hartree
zpe.thermalcorrenthalpy: 0.337617 hartree
zpe.thermalcorrgfe: 0.263937 hartree
zpe.sumelectzpe: -961.344852 hartree
zpe.sumelectthermal: -961.323625 hartree
zpe.sumelectthermalent: -961.322681 hartree
zpe.sumelectthermalfe: -961.396361 hartree
dipole: -1.3822 -2.5927 1.1163
dipole: 3.1430
quadrupole: -85.4894 -126.4298 -112.2288
quadrupole: -2.7017 -12.2170 -1.7612
quadrupole: 22.5599 -18.3805 -4.1795 -2.7017 -12.2170 -1.7612
hfenergy: -961.6602977 hartree
pointgroup: C01 [X(C13H20F1N1O4)]
dipole: -0.5998671 1.0812461 0.0126978 debye
polarizability: 206.6464173|-21.4964104|131.5844333|3.8191566|1.6374457|158.8488167 unknown
InChI: InChI=1S/C13H20FNO4/c1-13(2,3)15-6-8(16)7-19-12-5-11(18)10(17)4-9(12)14/h4-5,8,15-18H,6-7H2,1-3H3
charge 0 multiplicity 1
39 atoms
F  -1.267083 -0.533096 -2.845578
O  1.809169 -3.112008 -0.58427
O  -0.070084 -1.101358 -0.464608
O  -4.114384 0.40721 1.884009
O  -5.310104 0.982305 -0.475216
N  3.215144 0.022362 0.977822
C  3.67101 1.408969 0.624126
C  2.887753 -0.917443 -0.117887
C  1.950491 -2.03549 0.404662
C  4.882952 1.404388 -0.354981
C  2.489996 2.193965 0.000146
C  4.081768 2.082664 1.956262
C  0.576346 -1.489046 0.811242
C  -1.367437 -0.591441 -0.415283
C  -2.100879 -0.348499 0.771681
C  -1.982138 -0.294266 -1.656754
C  -3.406127 0.174623 0.700963
C  -3.281706 0.228079 -1.746142
C  -3.99605 0.462452 -0.555993
H  3.878924 -0.405882 1.640411
H  2.36265 -0.369367 -0.919948
H  3.77148 -1.41303 -0.577228
H  2.410044 -2.519019 1.286915
H  5.744773 0.869831 0.088691
H  5.204637 2.435923 -0.591257
H  4.62287 0.905861 -1.306652
H  2.782732 3.244043 -0.182558
H  1.623151 2.181347 0.684099
H  2.17128 1.764833 -0.966909
H  3.230076 2.091852 2.659453
H  4.408481 3.123346 1.78318
H  4.92128 1.540775 2.435078
H  0.704748 -0.604403 1.463124
H  -0.034672 -2.269156 1.304613
H  1.188735 -2.780824 -1.286223
H  -1.681189 -0.553967 1.758669
H  -3.704882 0.436892 -2.734361
H  -5.009989 0.77004 1.653104
H  -5.695868 1.162135 -1.364799
