program: Gaussian 09
title: 000131482
version: EM64L-G09RevD.01
frameworkgroup: C1[X(C10H15NO4)]
method: RPBEPBE
basis: SDD
operation: Freq
keyword: #p
keyword: freq=noraman
keyword: PBEPBE/SDD
title: #p freq=noraman PBEPBE/SDD
converged: YES YES NO NO
title: Mulliken charges:
elementType: O O O O N C C C C C C C C C C H H H H H H H H H H H H H H H
charge: -0.243013 -0.250865 -0.341377 -0.212665 -0.331344 0.325845 -0.540677 -0.712720 -0.714861 0.102086 -0.103630 0.213749 0.322939 -0.753524 -0.493539 0.240227 0.246299 0.239527 0.218084 0.237987 0.207832 0.231415 0.237481 0.241721 0.265192 0.274004 0.386223 0.233088 0.240341 0.234177
chargesum: 0.00000
title: Mulliken charges with hydrogens summed into heavy atoms:
elementType: O O O O N C C C C C C C C C C
charge: -0.243013 -0.250865 -0.341377 -0.212665 0.054879 0.325845 -0.054151 -0.017122 -0.038134 0.102086 -0.103630 0.213749 0.322939 0.027392 0.214067
polarizability: 1.98410739e+02 -8.13594922e+00 1.32445168e+02 4.17733290e+00 6.30976421e-01 8.67329304e+01
1716.lowfreq: -11.8496 -4.0263 -0.0004 -0.0003 0.0005 6.7028 33.5451 43.5954 81.5301
frequency: 33.4992 43.5855 81.5250 89.8040 115.8744 143.9621 154.7602 166.4618 181.8631 211.0393 229.9479 258.4326 268.7195 276.1664 320.7048 341.1784 361.7232 381.6786 405.7190 447.8902 449.5394 463.4730 514.9906 558.1766 568.6393 593.3821 625.4047 710.1904 736.2495 821.9919 851.7619 860.6357 914.9420 921.7486 933.5697 936.8216 958.6398 999.9733 1009.8244 1029.3143 1038.2690 1044.8179 1106.3442 1110.5367 1149.5326 1168.7573 1190.0747 1233.3427 1267.3160 1285.5374 1315.5534 1329.5346 1383.6634 1394.4086 1398.9176 1407.3219 1424.6032 1430.4893 1446.9711 1450.2098 1455.0731 1463.3785 1464.9951 1470.2099 1472.4611 1485.1243 1536.9177 1562.3250 1568.8777 2908.9170 2978.5513 2988.3716 2991.2680 2995.2354 3017.9400 3077.7342 3079.5783 3087.8217 3094.7270 3095.1121 3098.4008 3102.6230 3130.9396 3139.7152
redmass: 2.9435 4.2665 3.4743 3.8062 3.6651 1.8059 1.7055 1.5995 1.0609 1.5225 1.4126 4.3539 2.4990 4.8741 3.7505 3.3646 2.6766 3.9402 4.6700 3.7918 4.3111 5.5630 4.6524 3.9890 4.6093 4.1781 4.7416 4.8449 5.1299 4.1293 4.1919 4.4700 1.9051 1.2556 1.4623 3.2752 2.2287 3.4953 1.4167 2.4752 2.3848 1.5482 1.2552 1.5926 1.5595 2.0953 2.6168 1.8713 2.5809 4.7220 2.0829 3.8899 1.2343 1.3878 1.2100 1.3143 1.2173 1.0864 1.0867 1.1748 1.0584 1.4369 1.2863 1.0625 1.0675 1.0552 4.4910 3.3893 6.3616 1.0914 1.0299 1.0616 1.0360 1.0383 1.0368 1.0964 1.1059 1.0991 1.0995 1.0946 1.1006 1.0999 1.1028 1.1025
irintensity: 6.9886 5.8740 0.8618 2.0867 1.0065 0.7882 1.2331 1.7144 0.0796 0.7477 2.8127 2.2439 1.6442 3.3752 4.2684 10.8714 0.6334 16.0508 10.1817 2.8745 4.6427 14.9600 3.0105 11.1971 9.4686 5.3206 2.6161 9.3598 3.3618 4.2360 114.8374 10.4594 29.9672 134.1006 2.2061 59.4581 57.7177 37.1472 0.3359 68.6119 52.6013 10.2571 6.5764 6.8321 22.2513 143.1369 77.4009 1.8160 20.4448 134.7001 7.0117 182.5510 31.2001 14.0478 25.8684 42.6495 16.7764 11.7941 17.9457 21.3591 14.5288 154.5723 108.6412 5.0582 3.6670 11.6745 500.3605 102.3137 273.6907 211.6395 53.3533 13.3003 13.1752 17.2197 2.7842 5.1450 37.3704 15.6719 26.1463 4.9448 17.2036 34.9147 16.7475 12.4266
temp: 298.150 k
press: 1.00000 atm
elementType: 8 8 8 8 7 6 6 6 6 6 6 6 6 6 6 1 1 1 1 1 1 1 1 1 1 1 1 1 1 1
symmnumber: 1
zpe: 626940.7 jmol-1
zpe.correction: 0.238789 hartree
zpe.thermalcorrener: 0.255002 hartree
zpe.thermalcorrenthalpy: 0.255947 hartree
zpe.thermalcorrgfe: 0.195244 hartree
zpe.sumelectzpe: -744.511781 hartree
zpe.sumelectthermal: -744.495568 hartree
zpe.sumelectthermalent: -744.494623 hartree
zpe.sumelectthermalfe: -744.555326 hartree
dipole: 1.6280 -0.0009 -0.5304
dipole: 1.7122
quadrupole: -61.1023 -105.8415 -87.8538
quadrupole: -2.9976 -5.7073 0.8248
quadrupole: 23.8302 -20.9089 -2.9213 -2.9976 -5.7073 0.8248
hfenergy: -744.7505701 hartree
pointgroup: C01 [X(C10H15N1O4)]
dipole: 0.6408232 -0.017055 -0.2069706 debye
polarizability: 198.3094612|-8.1842796|132.4191921|4.9009754|-2.350368|86.8601837 unknown
InChI: InChI=1S/C10H15NO4/c1-6(11-14-4)8-7(12)5-10(2,3)15-9(8)13/h11H,5H2,1-4H3
charge 0 multiplicity 1
30 atoms
O  -1.674005 -1.462784 0.048471
O  -0.530751 2.555927 -0.304761
O  0.472514 -2.165811 0.161647
O  3.748971 -0.350613 0.742401
N  2.381023 -0.547026 0.342807
C  -2.698802 -0.352952 0.228734
C  -2.239257 0.855243 -0.605562
C  -2.789969 -0.039833 1.734977
C  -3.995564 -0.971628 -0.305919
C  -0.813574 1.311921 -0.268852
C  0.141659 0.236281 0.020138
C  -0.318813 -1.158511 0.076356
C  1.544245 0.508956 0.208997
C  2.12582 1.898762 0.259207
C  4.645762 -1.043528 -0.218107
H  -2.914572 1.714324 -0.452276
H  -2.272645 0.587997 -1.681041
H  -1.849022 0.388519 2.121667
H  -3.599229 0.68918 1.920806
H  -3.012785 -0.961627 2.2986
H  -4.825798 -0.247536 -0.222722
H  -3.881916 -1.259886 -1.365006
H  -4.257123 -1.874703 0.271704
H  3.219172 1.856484 0.366123
H  1.689741 2.464387 1.099766
H  1.830431 2.463086 -0.639949
H  1.944652 -1.517742 0.350061
H  4.418678 -2.12505 -0.254793
H  5.653807 -0.882437 0.193717
H  4.55905 -0.6008 -1.226494
