program: Gaussian 09
title: 000131481
version: EM64L-G09RevD.01
frameworkgroup: C1[X(C8H14N4)]
method: RPBEPBE
basis: SDD
operation: Freq
keyword: #pfreq=noraman
keyword: PBEPBE/SDD
title: #p freq=noraman PBEPBE/SDD
converged: YES YES NO NO
title: Mulliken charges:
elementType: N N N N C C C C C C C C H H H H H H H H H H H H H H
charge: -0.474127 -0.392893 -0.391164 -0.075743 0.059332 0.359287 0.111289 -0.322910 -0.355697 -0.630737 -0.639475 -0.606527 0.225730 0.273218 0.327423 0.285240 0.221601 0.204680 0.245708 0.216615 0.228866 0.226414 0.220050 0.228974 0.195744 0.259102
chargesum: 0.00000
title: Mulliken charges with hydrogens summed into heavy atoms:
elementType: N N N N C C C C C C C C
charge: -0.200909 -0.065470 -0.105924 -0.075743 0.059332 0.359287 0.111289 -0.097180 -0.134096 0.036266 0.035855 0.077293
polarizability: 1.63140549e+02 2.93874161e+00 1.25697101e+02 -2.88777658e-01 -5.85756267e+00 6.85487027e+01
1716.lowfreq: -9.7956 0.0007 0.0007 0.0009 7.3456 15.3134 39.7364 66.2125 74.2238
frequency: 39.4615 66.1975 74.2037 108.1123 126.6527 134.2507 158.8564 163.3076 209.5604 223.0401 236.3842 308.2015 349.2958 365.4330 396.2794 493.8302 508.9713 532.0292 590.8792 624.3256 648.4733 669.2799 719.4236 765.5746 793.0128 817.3202 918.2003 936.8896 998.7767 1065.9407 1079.0590 1095.4561 1113.4004 1122.9224 1125.1592 1135.2040 1156.8360 1188.2553 1210.4988 1314.6535 1339.4661 1348.0999 1375.3894 1401.8058 1423.7023 1430.8815 1436.5490 1443.5299 1450.9571 1465.5503 1468.4724 1474.8631 1496.4809 1498.6102 1502.0515 1547.4914 1566.1119 1600.8243 2910.6052 2941.2641 2965.1601 3006.3637 3024.8572 3053.8876 3079.0148 3089.4437 3100.9735 3114.4460 3166.3075 3468.8276 3492.3340 3592.7114
redmass: 1.0439 2.7507 2.9443 2.5112 2.4558 1.3450 1.1238 3.0284 3.5403 3.1023 3.7344 1.8194 3.4046 3.5986 1.7958 3.5103 2.4767 4.2232 2.2849 1.9911 2.9700 1.9490 3.6439 3.2656 1.7488 4.8526 4.6150 1.3848 3.1042 1.7258 2.3654 1.9245 1.3547 1.2852 1.2821 1.7811 1.7319 2.5746 2.4065 1.6310 3.2175 3.0240 1.8964 1.6579 1.3878 1.2778 1.1676 1.2382 1.1010 1.0458 1.1089 1.8187 1.0823 1.0560 1.1478 3.3078 5.4380 5.3152 1.0506 1.0394 1.0414 1.0988 1.0809 1.0918 1.1014 1.0957 1.1012 1.0891 1.0946 1.0748 1.0762 1.0766
irintensity: 0.9073 0.3809 7.0376 1.1155 0.6714 1.6938 0.8075 2.9066 4.3218 3.2160 10.1312 62.5105 18.8078 15.0639 54.1398 17.8630 29.8701 18.4970 30.8253 57.4021 0.8919 42.8004 3.3598 2.4645 61.3609 5.5377 6.7585 0.7523 6.9366 8.2979 2.6275 4.6233 10.6508 13.6326 1.8640 18.3940 0.5050 35.5749 13.9901 3.0266 22.8474 83.3168 64.1937 25.4549 25.9081 19.1164 4.8058 17.5155 33.1892 12.8892 17.3753 34.3210 8.7380 13.4360 80.3087 95.0298 41.2264 622.3362 107.6483 113.9706 107.3561 52.8611 42.8190 44.2194 31.9970 28.4555 21.7573 27.3303 21.9602 1.4090 49.3216 21.0541
temp: 298.150 k
press: 1.00000 atm
elementType: 7 7 7 7 6 6 6 6 6 6 6 6 1 1 1 1 1 1 1 1 1 1 1 1 1 1
symmnumber: 1
zpe: 573374.0 jmol-1
zpe.correction: 0.218387 hartree
zpe.thermalcorrener: 0.232041 hartree
zpe.thermalcorrenthalpy: 0.232985 hartree
zpe.thermalcorrgfe: 0.177869 hartree
zpe.sumelectzpe: -531.321309 hartree
zpe.sumelectthermal: -531.307654 hartree
zpe.sumelectthermalent: -531.306710 hartree
zpe.sumelectthermalfe: -531.361827 hartree
dipole: -1.3309 3.6174 -0.4382
dipole: 3.8793
quadrupole: -60.4417 -67.5469 -75.2231
quadrupole: 6.5895 -0.8633 -1.4549
quadrupole: 7.2956 0.1903 -7.4859 6.5895 -0.8633 -1.4549
hfenergy: -531.5396953 hartree
pointgroup: C01 [X(C8H14N4)]
dipole: 0.6435834 -1.3716263 -0.183808 debye
dipolederiv: -0.5291666 0.1395766 0.2171791 0.00971 -0.5839704 0.1033341 0.1415203 0.1336082 -0.3285437 -1.4910885 0.0631087 0.1160272 0.3951709 -0.421312 0.027591 0.0369801 0.0671796 -0.4346042 -1.3707244 -0.296081 0.0123056 -0.5895707 -0.457484 -0.0460286 -0.2318704 -0.0952584 -0.5101308 -0.7603383 -0.0297373 0.0178064 -0.5316896 -0.7867238 -0.0465021 -0.068253 -0.0910096 -0.2703457 -0.858003 -0.114974 -0.0233941 -0.1050929 0.4097075 0.0487134 0.004839 0.1266368 -0.1591343 1.4499716 -0.1780641 -0.1260679 -0.5054626 0.3988092 0.0919721 -0.155843 0.0076867 0.1591209 1.4417103 0.4555729 0.0414332 0.7720637 0.5977884 0.0759854 0.09448 0.0998865 0.1528043 -0.4877779 0.0959883 0.0339554 0.3874179 -0.3498311 -0.0369959 0.0910132 -0.0221219 -0.282239 0.7539475 0.0330141 -0.0407127 0.1622113 0.4100971 0.0795968 -0.0013405 0.0916503 -0.0647679 0.2487844 -0.0951542 -0.0614801 0.0222385 0.2893923 -0.1594687 -0.0899999 -0.2956783 0.3579156 0.6544073 0.141962 -0.0328373 0.3425525 0.2707763 -0.0619841 0.0414793 -0.033178 0.2801123 0.6692145 -0.0295627 -0.0779109 -0.189242 0.1683793 0.0597758 -0.0519802 0.0603964 0.2810093 -0.0552395 -0.1189191 -0.0042852 -0.0910825 0.0038264 -0.0208747 -0.0103499 -0.0213871 0.1842009 0.1943789 -0.0688614 -0.1989957 -0.0113987 0.0343619 0.008243 -0.0787646 0.0150594 0.1273549 0.1861887 0.032789 -0.0097238 -0.0003261 0.2277159 -0.0339387 0.0483869 -0.0476434 0.2701686 0.1283352 0.0301672 0.0204044 0.0630277 0.0999398 -0.0097977 0.0684524 0.0290775 0.30393 0.0795518 0.0236644 0.006395 0.0020971 -0.1605367 -0.0466204 -0.0016162 -0.0552635 0.1157767 -0.1426259 -0.0929029 0.1718804 0.017876 0.0278899 0.0375798 0.0977184 0.1206222 -0.0711108 -0.0237101 -0.0271898 -0.1140044 -0.0788376 0.0950723 -0.0597606 -0.0634744 -0.002613 -0.0218789 0.0906237 0.0648409 0.0318957 0.0589294 -0.2237416 -0.0131013 0.0256959 -0.0694012 0.0495583 0.0066821 -0.0191929 -0.0001627 -0.1627695 0.0115736 -0.0834766 -0.1143395 -0.1004095 -0.1158937 -0.0073339 0.0037947 -0.0178907 -0.1889612 -0.0678391 0.1519808 0.0625465 0.1272631 -0.0711163 -0.0943297 0.0720837 0.0338479 0.1694743 -0.0098692 -0.0349116 0.0499649 -0.0227747 0.1118054 -0.064427 -0.0040351 0.0261183 0.1113356 0.0785479 -0.053521 0.172551 -0.0374045 -0.1677067 -0.0942896 -0.0858462 -0.0321498 -0.1951205 -0.044048 -0.0726001 -0.051466 -0.0749365 0.0808832 0.0752583 0.0039582 0.0103668 0.135449 -0.0185219 0.0948099 -0.0163301 0.0900129 0.0228317 unknown
polarizability: 162.0322865|6.5380379|126.7082409|-4.9243506|4.6854048|68.6458255 unknown
InChI: InChI=1S/C8H14N4/c1-9-6-4-5-12-8(11-3)7(6)10-2/h4-5,9-11H,1-3H3
charge 0 multiplicity 1
26 atoms
N  0.325693 -1.910319 -0.418362
N  2.500911 -0.226273 -0.287472
N  -2.329972 -0.704808 -0.11504
N  -1.380498 1.426523 0.210805
C  0.107406 -0.499325 -0.189352
C  1.254943 0.34832 -0.112307
C  -1.186561 0.084502 -0.021358
C  1.056709 1.742439 0.138116
C  -0.262452 2.205517 0.284198
C  0.342331 -2.801165 0.768195
C  3.751089 0.522998 -0.313108
C  -3.675424 -0.164708 0.096107
H  1.897335 2.437594 0.209569
H  -0.164591 -2.298411 -1.232115
H  2.464447 -1.213285 -0.561003
H  -2.203403 -1.714058 -0.15587
H  -0.448376 3.269565 0.477846
H  -0.621425 -2.842535 1.325321
H  1.113602 -2.447188 1.474613
H  0.609382 -3.82775 0.457428
H  3.943888 1.030789 0.653067
H  3.763596 1.296645 -1.10946
H  4.587047 -0.171389 -0.500641
H  -3.86378 0.094285 1.157364
H  -4.418885 -0.912982 -0.230502
H  -3.805114 0.759319 -0.490537
