program: Gaussian 09
title: 000131479
version: EM64L-G09RevD.01
frameworkgroup: C1[X(C11H20N4SSi2)]
method: RPBEPBE
basis: SDD
operation: Freq
keyword: #p
keyword: freq=noraman
keyword: PBEPBE/SDD
title: #p freq=noraman PBEPBE/SDD
converged: YES YES NO NO
title: Mulliken charges:
elementType: S Si Si N N N N C C C C C C C C C C C H H H H H H H H H H H H H H H H H H H H
charge: -0.077610 1.387693 1.063542 -0.582184 -0.043226 -0.046037 -0.030861 -1.043965 -1.020125 -1.019973 0.172257 0.122912 -0.198289 -0.308636 -1.009774 -0.999370 -0.999779 -0.395378 0.247787 0.247856 0.253206 0.243118 0.235922 0.281602 0.243393 0.281305 0.236017 0.264830 0.251859 0.236762 0.252365 0.281026 0.229289 0.244506 0.244570 0.229459 0.280977 0.242955
chargesum: 0.00000
title: Mulliken charges with hydrogens summed into heavy atoms:
elementType: S Si Si N N N N C C C C C C C C C C C
charge: -0.077610 1.387693 1.063542 -0.582184 -0.043226 -0.046037 -0.030861 -0.295117 -0.259484 -0.259259 0.172257 0.122912 0.066541 -0.308636 -0.268787 -0.244549 -0.244772 -0.152423
polarizability: 3.20176991e+02 5.00177863e+00 2.02753636e+02 -1.35828045e-01 6.10042875e-02 1.46496808e+02
1716.lowfreq: -5.5030 -0.0017 -0.0016 -0.0014 2.0024 8.9227 24.1661 36.8608 55.2451
frequency: 24.0237 36.2932 54.9927 58.9833 63.9700 106.9992 123.8090 128.0576 135.6678 147.1676 148.0015 149.6896 154.0021 156.5801 161.2421 165.6073 179.0258 188.3095 198.8400 203.0628 211.1652 225.3140 227.7104 247.3167 259.7406 320.0840 375.5333 388.1268 420.8682 541.1796 544.3368 592.1411 599.4116 618.7886 632.1692 654.1804 663.7664 703.2181 710.5634 713.0389 715.4392 759.7001 762.9373 795.4833 810.4270 814.9686 816.4408 818.7667 829.5179 846.5158 897.2230 918.8202 919.1154 920.8982 921.7638 922.2901 925.0657 931.2024 1035.5380 1103.3252 1156.9512 1178.3768 1258.9617 1287.4170 1290.3628 1294.7512 1299.8136 1303.9156 1308.2257 1308.6759 1320.3497 1350.0293 1391.5607 1415.5372 1430.3023 1437.2268 1442.0557 1446.1049 1447.5894 1449.7700 1450.0633 1450.8947 1455.6474 1457.9569 1465.8246 1467.4726 1502.9902 1532.5992 2984.6642 2984.9532 2986.1821 2986.2484 2987.3236 2988.3305 3084.9574 3086.4161 3086.6751 3087.9976 3090.0021 3091.6130 3093.1008 3100.3172 3102.2224 3103.0421 3117.1071 3117.6397 3162.7332 3233.0680
redmass: 4.4854 3.2383 4.1113 4.5295 4.3103 3.9153 1.0394 3.1877 3.9468 1.0711 1.1339 1.6774 1.3318 1.0386 1.0592 3.0832 2.6996 3.3102 2.8326 2.6814 2.8025 4.1603 3.4698 3.6945 4.5342 6.6821 6.2797 9.0525 13.4897 7.5727 4.6606 6.1213 4.2164 5.6059 7.1744 4.9186 8.6320 3.1829 2.9646 2.9319 2.9686 1.1710 1.1717 5.5535 1.3856 7.0136 1.3614 1.4310 1.3799 1.6065 3.5970 1.5044 1.4430 1.4992 1.5960 1.5150 1.5190 1.7619 10.7953 6.7913 3.7847 3.3357 3.7943 4.6459 1.2003 1.2828 3.2105 1.2026 1.1980 1.2145 1.2057 9.3496 1.5703 3.7753 1.0522 1.0506 1.0491 1.0492 1.0578 1.0540 1.0511 1.0542 1.0526 1.0464 1.0532 1.0483 8.2027 10.7634 1.0349 1.0354 1.0351 1.0350 1.0344 1.0344 1.0973 1.0974 1.0966 1.0965 1.0982 1.0977 1.0988 1.0988 1.0993 1.0989 1.0991 1.0989 1.0918 1.0974
irintensity: 1.9577 0.1062 0.0226 1.6860 0.0010 1.5884 0.0004 0.6890 1.1329 0.1315 0.4322 0.9474 0.6176 0.2979 0.0288 1.5626 2.1465 0.0046 1.1584 3.5268 4.6946 1.2815 12.7178 0.0446 0.9598 2.8328 85.3337 11.6817 2.8713 11.8834 0.5772 5.5653 29.6533 13.8401 5.2785 13.0157 6.7771 9.0379 8.0839 8.5923 8.2682 0.4324 0.0712 2.1714 29.2735 45.3693 9.0679 9.0170 27.2064 3.7901 369.2200 99.9596 9.8235 12.4423 68.4232 169.0921 296.3211 72.7581 174.5400 2.7405 161.4858 6.8717 37.4134 38.4872 52.7911 61.0110 58.2462 55.6473 29.6243 37.8277 24.2859 95.7057 55.8428 55.7858 0.1843 0.0030 9.7512 5.1952 7.1417 1.1400 9.1130 0.4548 4.4821 9.1543 37.0161 14.4561 149.3349 197.6024 7.8610 12.3980 6.9837 30.4239 10.4460 12.4522 3.0740 7.5879 5.2368 30.8818 1.3084 34.5357 14.3869 11.6266 3.8367 6.3437 2.1388 7.9658 14.6446 0.8272
temp: 298.150 k
press: 1.00000 atm
elementType: 16 14 14 7 7 7 7 6 6 6 6 6 6 6 6 6 6 6 1 1 1 1 1 1 1 1 1 1 1 1 1 1 1 1 1 1 1 1
symmnumber: 1
zpe: 776223.5 jmol-1
zpe.correction: 0.295648 hartree
zpe.thermalcorrener: 0.319170 hartree
zpe.thermalcorrenthalpy: 0.320114 hartree
zpe.thermalcorrgfe: 0.242335 hartree
zpe.sumelectzpe: -1625.748141 hartree
zpe.sumelectthermal: -1625.724620 hartree
zpe.sumelectthermalent: -1625.723675 hartree
zpe.sumelectthermalfe: -1625.801454 hartree
dipole: 2.9261 -1.9477 0.0543
dipole: 3.5155
quadrupole: -95.3471 -137.7754 -131.4908
quadrupole: 7.5107 -0.0084 0.0058
quadrupole: 26.1907 -16.2376 -9.9530 7.5107 -0.0084 0.0058
hfenergy: -1626.0437892 hartree
pointgroup: C01 [X(C11H20N4S1Si2)]
dipole: -1.1808962 -0.5721249 0.437207 debye
polarizability: 319.2017288|-2.0946504|176.3029187|12.3613322|-28.2644478|173.9227874 unknown
InChI: InChI=1S/C11H20N4SSi2/c1-17(2,3)15-8-14-9-10(15)12-7-13-11(9)16-18(4,5)6/h7-8H,1-6H3
charge 0 multiplicity 1
38 atoms
S  2.609394 1.411938 -0.557962
Si -4.160975 0.306049 0.048976
Si 4.32387 0.311396 0.563474
N  -2.428508 0.844071 -0.330249
N  -0.622164 1.959196 -1.267786
N  -1.190419 -0.676916 1.184664
N  1.238409 -0.369906 1.045964
C  -5.264142 1.395883 -1.055793
C  -4.434648 0.621393 1.901829
C  -4.265065 -1.537255 -0.394928
C  -1.269167 0.311269 0.247225
C  -0.160919 1.007484 -0.339982
C  -1.960668 1.825909 -1.227743
C  1.132069 0.620018 0.104371
C  5.824646 1.208634 -0.203544
C  4.187093 0.649185 2.430895
C  4.30597 -1.53619 0.111035
C  0.098181 -0.95752 1.530604
H  -5.141397 2.469357 -0.824312
H  -5.049024 1.241155 -2.128508
H  -6.327038 1.140608 -0.890456
H  -4.346013 1.69554 2.143017
H  -5.437574 0.279186 2.217364
H  -3.677931 0.068111 2.485157
H  -4.0603 -1.70324 -1.467539
H  -3.52022 -2.100382 0.194191
H  -5.26867 -1.942669 -0.169474
H  -2.643627 2.419447 -1.832315
H  5.801339 2.289979 0.019699
H  6.764789 0.794617 0.207816
H  5.848166 1.084334 -1.300656
H  3.245016 0.226616 2.816524
H  5.035759 0.186841 2.970854
H  4.198052 1.73456 2.633482
H  4.386442 -1.673191 -0.981638
H  5.156157 -2.059265 0.589746
H  3.364766 -1.993583 0.456844
H  0.243752 -1.742057 2.279054
