program: Gaussian 09
title: 000131475
version: EM64L-G09RevD.01
frameworkgroup: C1[X(C13H20ClN3O)]
method: RPBEPBE
basis: SDD
operation: Freq
keyword: #p
keyword: freq=noraman
keyword: PBEPBE/SDD
title: #p freq=noraman PBEPBE/SDD
converged: YES YES NO NO
title: Mulliken charges:
elementType: Cl O N N N C C C C C C C C C C C C C H H H H H H H H H H H H H H H H H H H H
charge: -0.006702 -0.284147 -0.106979 -0.373964 -0.515898 -0.342777 -0.326100 -0.339194 -0.403879 -0.673663 -0.670989 0.159548 0.283133 -0.347237 -0.334629 -0.324976 -0.403195 0.409819 0.234992 0.194153 0.188170 0.207117 0.190607 0.235756 0.248994 0.234610 0.207594 0.228325 0.203572 0.208885 0.225243 0.204256 0.297240 0.278742 0.220437 0.264347 0.227238 0.301552
chargesum: 0.00000
title: Mulliken charges with hydrogens summed into heavy atoms:
elementType: Cl O N N N C C C C C C C C C C C C C
charge: -0.006702 -0.284147 -0.106979 -0.076724 -0.214346 0.086368 0.069188 0.087168 0.079725 -0.034172 -0.032605 0.159548 0.283133 -0.068496 -0.114192 -0.060629 -0.175957 0.409819
polarizability: 3.18800156e+02 4.77783198e+00 1.66041976e+02 -1.26540391e+01 -1.34544676e+01 1.14701477e+02
1716.lowfreq: -5.5536 -0.0013 0.0012 0.0023 2.1402 9.1982 10.5343 18.6336 25.3460
frequency: 9.7100 18.6092 24.9813 44.4016 57.7578 62.0197 74.8205 81.4658 86.6389 125.3454 151.6245 179.4552 203.0072 237.9073 258.5272 284.8311 286.5438 307.8100 322.4013 334.0168 396.5291 401.8182 407.1230 445.2663 457.9229 479.9804 520.2381 535.6026 547.4118 616.0919 631.5864 678.0912 730.2316 751.2193 756.0435 793.4338 796.4729 805.3899 811.5649 836.9352 847.4391 858.1870 916.3757 938.4046 988.8081 991.6663 993.2722 1009.4667 1039.5172 1066.3403 1072.9654 1077.9292 1084.4186 1115.7376 1124.2441 1141.9169 1175.9598 1187.2343 1206.9929 1238.1512 1247.2695 1261.7478 1272.4372 1281.3922 1292.8905 1303.9424 1315.0401 1331.4164 1361.5082 1374.5569 1381.5996 1383.5127 1387.2996 1389.4822 1420.5869 1438.7692 1460.9444 1462.8040 1471.5088 1474.7437 1479.6564 1482.3772 1488.1082 1491.8995 1500.8757 1556.4134 1592.5751 1607.7888 2854.0451 2868.4690 2907.5685 2979.9331 2981.7822 3025.8185 3029.4652 3032.9008 3034.3619 3071.5400 3074.8540 3089.6062 3090.2596 3096.6337 3117.6398 3140.5261 3154.5715 3173.8557 3400.8853 3564.2848
redmass: 4.4069 6.3533 4.3528 4.9123 4.5342 4.3464 2.5423 2.6769 3.3661 3.9515 4.5681 1.6100 1.2536 2.8292 1.9555 2.5216 3.2396 3.4960 3.8852 4.4655 3.0760 3.0244 3.5311 3.5810 3.1813 2.9302 1.7345 2.6638 2.4579 5.7319 5.9555 3.8305 1.7705 2.8312 3.1952 1.1341 1.2832 1.9749 1.7467 1.9732 2.0957 1.5879 1.9658 1.3886 2.2844 3.0777 1.5778 2.7836 3.3715 1.9008 2.7172 1.8989 2.2008 1.3801 1.7385 2.6777 1.9071 1.1902 2.2635 1.9199 1.5193 1.6545 2.0928 1.1878 1.1989 1.1736 1.3702 1.3391 1.3294 1.2963 1.3120 1.2414 1.2570 3.3264 3.4786 1.1398 1.0571 1.0527 1.2142 1.5471 1.0456 1.0790 1.0841 1.1229 2.2264 6.5173 7.0042 6.1441 1.0721 1.0714 1.0691 1.0357 1.0356 1.0634 1.0846 1.0883 1.0906 1.0982 1.0983 1.1004 1.1002 1.1048 1.0866 1.0965 1.0883 1.0972 1.0761 1.0774
irintensity: 1.0800 1.8023 1.7331 5.0392 6.4480 7.0799 0.2644 0.0072 0.9174 10.6936 3.2576 2.5780 1.1393 0.7422 5.3339 7.9512 2.4826 30.5292 6.3005 7.4083 5.6284 23.8503 1.5591 16.6130 96.9651 18.8865 98.0637 23.2561 154.8637 3.1860 20.8281 30.6744 2.8947 14.0788 3.9003 5.1522 9.9893 8.9286 17.1119 71.0382 62.8787 18.4747 0.1002 1.3327 3.5186 3.8224 0.7220 1.3179 8.2989 25.6912 24.0244 35.0829 3.6622 6.4824 19.9152 7.0346 33.0394 26.7461 46.4048 9.4825 14.6920 4.3873 203.0354 0.6531 12.6619 16.8250 2.5683 17.2612 7.4393 4.4137 4.6399 25.2138 20.8368 14.1779 3.9067 27.9653 8.9433 4.7386 81.0817 121.0747 3.1981 19.3546 11.7328 16.4023 107.4130 59.1478 80.8229 26.9423 66.8993 122.3889 69.2532 33.5605 34.5685 33.7071 7.2067 20.1703 28.1245 57.9537 68.6800 33.0983 51.4456 14.0975 13.4975 16.3873 0.1745 1.7789 12.2332 13.9476
temp: 298.150 k
press: 1.00000 atm
elementType: 17 8 7 7 7 6 6 6 6 6 6 6 6 6 6 6 6 6 1 1 1 1 1 1 1 1 1 1 1 1 1 1 1 1 1 1 1 1
symmnumber: 1
zpe: 824394.5 jmol-1
zpe.correction: 0.313995 hartree
zpe.thermalcorrener: 0.334084 hartree
zpe.thermalcorrenthalpy: 0.335028 hartree
zpe.thermalcorrgfe: 0.260700 hartree
zpe.sumelectzpe: -1205.495637 hartree
zpe.sumelectthermal: -1205.475548 hartree
zpe.sumelectthermalent: -1205.474604 hartree
zpe.sumelectthermalfe: -1205.548932 hartree
dipole: -0.8362 -4.4243 0.6335
dipole: 4.5470
quadrupole: -116.2924 -110.2487 -118.1321
quadrupole: -6.1197 9.8522 -6.3039
quadrupole: -1.4013 4.6424 -3.2411 -6.1197 9.8522 -6.3039
hfenergy: -1205.8096319 hartree
pointgroup: C01 [X(C13H20Cl1N3O1)]
dipole: 0.2195419 -1.5598825 -0.8478222 debye
polarizability: 318.04065|-12.9777619|151.6424055|-9.5899256|27.9109366|129.8605535 unknown
InChI: InChI=1S/C13H20ClN3O/c1-3-17(4-2)10-9-15-13(18)11-5-7-12(16-14)8-6-11/h5-8,15-16H,3-4,9-10H2,1-2H3
charge 0 multiplicity 1
38 atoms
Cl -7.013067 1.071194 0.272944
O  0.331875 1.60229 0.292452
N  4.254103 -0.325944 0.186446
N  0.619483 -0.353757 -0.927728
N  -5.831018 -0.426761 0.137962
C  2.834801 -0.751515 0.208165
C  5.197344 -1.344897 0.716798
C  4.445446 1.02315 0.792933
C  2.078585 -0.174302 -1.017891
C  5.416634 -2.522469 -0.252336
C  5.654619 1.777676 0.209167
C  -0.172023 0.571327 -0.263059
C  -1.65257 0.30142 -0.227457
C  -2.42224 0.994181 0.747654
C  -2.319758 -0.563617 -1.13304
C  -3.806648 0.800902 0.851686
C  -3.715721 -0.738006 -1.064548
C  -4.466536 -0.084679 -0.045573
H  2.30927 -0.421093 1.134476
H  2.783852 -1.855829 0.18199
H  4.867012 -1.731542 1.714705
H  6.168814 -0.844592 0.883405
H  4.543469 0.950828 1.90528
H  3.529013 1.612136 0.60476
H  2.272119 0.90948 -1.081857
H  2.453871 -0.646367 -1.942673
H  6.144149 -3.24128 0.169192
H  5.802489 -2.151232 -1.217755
H  4.479307 -3.074809 -0.44943
H  5.742929 2.779361 0.669868
H  5.536143 1.898549 -0.881748
H  6.603993 1.241155 0.389998
H  0.211457 -1.233301 -1.24457
H  -1.897323 1.685695 1.414385
H  -1.773112 -1.060563 -1.943264
H  -4.392777 1.327562 1.610544
H  -4.224665 -1.379018 -1.794862
H  -6.22722 -0.963535 -0.653421
