program: Gaussian 09
title: 000131468
version: EM64L-G09RevD.01
frameworkgroup: C1[X(C14H18N2O5)]
method: RPBEPBE
basis: SDD
operation: Freq
keyword: #p
keyword: freq=noraman
keyword: PBEPBE/SDD
title: #p freq=noraman PBEPBE/SDD
converged: YES YES NO NO
title: Mulliken charges:
elementType: O O O O O N N C C C C C C C C C C C C C C H H H H H H H H H H H H H H H H H H
charge: -0.264596 -0.417517 -0.297452 -0.325908 -0.424340 -0.216445 -0.407914 -0.055548 -0.471968 -0.059502 -0.487034 -0.253695 0.132992 0.145013 0.435870 -0.493124 -0.558820 -0.513271 0.213351 0.161988 -0.522460 0.287973 0.248647 0.227455 0.278356 0.244531 0.224102 0.243545 0.290792 0.341022 0.284249 0.251623 0.222282 0.226155 0.221102 0.383758 0.240757 0.229476 0.234555
chargesum: 0.00000
title: Mulliken charges with hydrogens summed into heavy atoms:
elementType: O O O O O N N C C C C C C C C C C C C C C
charge: -0.264596 -0.076495 -0.297452 -0.325908 -0.040582 -0.216445 -0.117122 0.232426 0.004134 0.218854 -0.018401 -0.010150 0.132992 0.145013 0.435870 -0.208875 -0.307197 0.156268 0.213351 0.161988 0.182328
polarizability: 2.55680810e+02 -6.11746499e+00 1.87152900e+02 -1.74419613e-01 1.12678855e+01 1.25501921e+02
1716.lowfreq: -12.2928 -7.4041 -0.0005 -0.0005 0.0002 7.0023 32.5715 42.8781 48.9155
frequency: 32.4526 42.8045 48.9123 75.0547 95.0365 103.3211 105.7562 138.8713 158.8713 171.4289 177.8256 207.8548 216.3491 221.4785 235.9600 252.2199 268.6076 304.0940 316.6573 341.2515 362.1148 377.6009 389.2914 424.4097 428.9883 462.3609 478.1647 504.7610 524.9244 528.6303 561.5723 608.8002 620.1315 628.9979 654.5236 675.5655 702.3612 741.3698 758.2558 760.3631 800.2011 843.2761 856.9071 868.6918 881.6374 896.0012 905.5422 938.7478 944.1744 978.4213 1009.3529 1024.8458 1059.9110 1069.5357 1080.4064 1115.5488 1117.7125 1118.1285 1142.4328 1152.3703 1163.0610 1168.0770 1175.8455 1181.9705 1197.2849 1215.6073 1232.0062 1252.7712 1273.3598 1287.3790 1297.8414 1304.0769 1311.9676 1319.6374 1330.8998 1347.6237 1353.2696 1368.8659 1410.1027 1436.3437 1440.7345 1445.3556 1453.1660 1459.4413 1463.2233 1475.3301 1477.1874 1480.6618 1498.1628 1509.0312 1547.2811 1592.2472 1638.9330 2954.7400 2969.9857 2986.4334 3005.4867 3019.2647 3031.8120 3034.6439 3039.8731 3061.0412 3097.1780 3107.4327 3109.0001 3129.6013 3155.9899 3161.7137 3501.4443 3516.4041 3561.0857
redmass: 4.1554 5.1154 4.4414 4.4301 3.9254 2.6702 5.6432 3.9562 2.3382 1.9634 1.3721 1.5842 1.7832 2.7460 3.3695 3.9823 3.9330 4.5766 4.6320 3.9341 3.9206 3.9304 3.6743 3.7987 3.5826 3.0842 3.2906 4.8219 3.6645 1.1122 4.2274 5.0397 5.4762 5.4767 2.9922 4.9111 4.4966 5.7265 3.4460 5.4787 3.4169 3.2449 1.8068 4.2846 1.6126 2.9068 3.1674 2.6683 2.3901 4.7259 4.2627 4.0687 1.6546 3.0252 2.2084 1.5078 1.2561 1.5597 1.5810 1.7501 1.7968 1.6136 2.4355 2.2161 1.5007 1.5212 1.5195 1.6426 1.3939 3.1484 1.4820 1.4746 1.8214 1.4846 1.3295 1.4329 1.8624 1.8584 3.7887 1.1435 1.2653 3.3775 1.0567 1.0894 1.0492 1.0852 1.0949 1.0581 2.0223 3.0729 10.2573 5.6993 7.1198 1.0320 1.0321 1.0842 1.0866 1.0692 1.0641 1.0812 1.1028 1.1045 1.1001 1.1006 1.1036 1.1008 1.0918 1.0909 1.0645 1.0753 1.0669
irintensity: 0.2201 2.2243 2.4597 4.4473 5.2217 4.8549 2.8969 6.2338 4.8302 1.0842 131.6665 10.6705 7.6783 4.9609 10.9568 12.1850 6.6890 3.3083 0.4548 0.9866 6.7352 8.8211 1.8064 3.3436 6.7239 35.8749 14.1298 17.0280 62.5194 134.3233 11.3689 16.7838 31.1806 11.4378 4.2382 6.0814 3.1784 57.8352 11.1923 27.5811 25.7100 11.0858 25.1447 118.1716 54.2042 55.2963 18.2025 8.0189 40.2984 12.5903 97.0315 97.2082 44.3448 36.6836 4.9041 16.6409 0.1372 19.8632 21.3879 7.6691 103.1458 34.7628 248.2033 46.2994 25.8971 13.9516 36.7461 96.1570 35.3254 26.7092 6.9480 59.7855 153.7436 48.6919 8.7089 29.6221 115.0366 35.5896 191.3619 9.8785 2.9371 94.4420 12.5125 12.1053 15.2219 72.5912 15.0874 7.7984 167.8898 78.7959 242.3161 114.7969 54.1811 47.9217 55.4213 24.0400 32.0435 5.4321 32.0227 40.4097 35.7582 39.2129 15.9688 33.3991 31.8036 24.6467 4.8987 5.3233 113.4959 8.7827 7.0852
temp: 298.150 k
press: 1.00000 atm
elementType: 8 8 8 8 8 7 7 6 6 6 6 6 6 6 6 6 6 6 6 6 6 1 1 1 1 1 1 1 1 1 1 1 1 1 1 1 1 1 1
symmnumber: 1
zpe: 813841.8 jmol-1
zpe.correction: 0.309976 hartree
zpe.thermalcorrener: 0.330212 hartree
zpe.thermalcorrenthalpy: 0.331156 hartree
zpe.thermalcorrgfe: 0.261323 hartree
zpe.sumelectzpe: -1028.314524 hartree
zpe.sumelectthermal: -1028.294288 hartree
zpe.sumelectthermalent: -1028.293344 hartree
zpe.sumelectthermalfe: -1028.363177 hartree
dipole: 0.5383 1.2174 -0.0667
dipole: 1.3328
quadrupole: -114.4421 -117.7877 -118.8872
quadrupole: -16.2187 -4.3824 10.5280
quadrupole: 2.5969 -0.7487 -1.8482 -16.2187 -4.3824 10.5280
hfenergy: -1028.6245004 hartree
pointgroup: C01 [X(C14H18N2O5)]
dipole: -0.2619784 0.4412214 -0.1078804 debye
polarizability: 253.3444318|14.776211|178.9738931|2.2580248|-25.6497715|136.0173064 unknown
InChI: InChI=1S/C14H18N2O5/c1-20-11-5-7-8(6-10(11)17)15-13(18)9-3-4-12(21-2)16(9)14(7)19/h5-6,9,12-13,15,17-18H,3-4H2,1-2H3
charge 0 multiplicity 1
39 atoms
O  4.047602 -0.715965 -0.401536
O  1.280172 3.462084 -0.03435
O  0.798381 -2.249299 0.633912
O  -4.252428 -1.141884 0.707124
O  -4.466303 1.025857 -0.844575
N  1.854644 -0.173354 0.530792
N  0.349188 1.522392 -1.241975
C  1.808154 1.292199 0.750552
C  3.207549 1.642448 1.3355
C  3.197186 -0.72607 0.795765
C  3.802874 0.280775 1.784303
C  1.49559 2.071359 -0.535022
C  0.722802 -0.985613 0.460851
C  -0.585586 -0.315781 0.180149
C  -0.747225 0.849029 -0.636946
C  -1.741436 -1.004782 0.648214
C  -2.061589 1.282356 -0.970343
C  3.556757 -1.619115 -1.45147
C  -3.024099 -0.564119 0.318017
C  -3.186309 0.587905 -0.50919
C  -4.189641 -2.361956 1.51496
H  1.002291 1.534269 1.471144
H  3.124989 2.370402 2.156842
H  3.839723 2.091342 0.550325
H  3.084312 -1.760669 1.169824
H  4.903229 0.260713 1.74517
H  3.479066 0.02248 2.808567
H  2.366172 2.066344 -1.222064
H  0.116408 2.001349 -2.115645
H  1.340257 4.09987 -0.790141
H  -1.570057 -1.916951 1.227534
H  -2.21446 2.177105 -1.581993
H  4.321653 -1.606178 -2.243825
H  2.587488 -1.270339 -1.858471
H  3.428203 -2.64914 -1.063379
H  -5.125016 0.414257 -0.417837
H  -5.235394 -2.647641 1.699911
H  -3.674982 -2.170387 2.475703
H  -3.667365 -3.16959 0.968103
