program: Gaussian 09
title: 000131460
version: EM64L-G09RevD.01
frameworkgroup: C1[X(C14H23N3S2)]
method: RPBEPBE
basis: SDD
operation: Freq
keyword: #p
keyword: freq=noraman
keyword: PBEPBE/SDD
title: #p freq=noraman PBEPBE/SDD
converged: YES YES NO NO
title: Mulliken charges:
elementType: S S N N N C C C C C C C C C C C C C C H H H H H H H H H H H H H H H H H H H H H H H
charge: 0.187604 0.494796 -0.085662 -0.452379 -0.395383 -0.393568 -0.453315 -0.432376 0.359231 -0.339167 -0.360905 -0.351001 -0.347754 0.181138 -0.620822 -0.649070 -0.355053 -0.272863 -0.694023 0.217858 0.189122 0.194912 0.274498 0.233998 0.206005 0.238391 0.194289 0.193422 0.211215 0.212575 0.189121 0.188420 0.187914 0.227575 0.225914 0.283244 0.282497 0.195933 0.195893 0.217397 0.210187 0.210192
chargesum: 0.00000
title: Mulliken charges with hydrogens summed into heavy atoms:
elementType: S S N N N C C C C C C C C C C C C C C
charge: 0.187604 0.494796 -0.085662 -0.452379 -0.395383 0.013412 0.016095 0.007627 0.359231 -0.100776 0.026806 0.072789 0.029787 0.181138 0.020582 -0.083328 0.036773 -0.272863 -0.056247
polarizability: 2.82883643e+02 -1.43576004e+00 2.41787446e+02 3.26832956e+00 7.41831259e+00 1.28310132e+02
1716.lowfreq: -31.6034 -4.4650 -0.0013 0.0007 0.0018 1.8776 9.0905 16.8616 25.7102
frequency: -28.8928 16.7099 25.5850 33.0425 59.1036 69.9507 87.7790 92.1177 118.4867 122.7001 130.7122 145.9211 157.0697 174.7817 206.0047 217.2034 232.4379 235.1486 267.0582 284.6018 305.6990 327.9367 355.0777 381.6533 424.7697 433.7470 444.1485 454.5670 475.8633 510.0897 545.5382 618.0515 658.1640 693.4272 702.3579 716.5476 723.0717 738.9339 765.7176 779.9268 785.8121 868.2074 869.3849 890.6289 908.6156 938.9878 950.6196 971.9012 989.9230 1005.4419 1030.9775 1040.8371 1049.0793 1064.0874 1072.2343 1077.9456 1082.3550 1094.4213 1115.1495 1116.4591 1143.9711 1189.4128 1191.5743 1197.9772 1223.6291 1235.3638 1253.2167 1258.7028 1265.6700 1274.7958 1286.6419 1286.8086 1294.8435 1312.4545 1318.2318 1331.9973 1341.4714 1346.3869 1352.4814 1369.2633 1387.7510 1390.7305 1417.9278 1432.2255 1439.7605 1440.5029 1455.3358 1462.8056 1463.5011 1463.7150 1472.1348 1477.0545 1478.7023 1480.7577 1482.3378 1487.3253 1656.0815 2812.3781 2837.2518 2856.5374 2955.2011 2961.0748 2968.9999 2969.4791 2972.9665 2979.0665 2992.4275 3008.9254 3016.4892 3018.7442 3027.7476 3029.9539 3036.3458 3038.1816 3045.7640 3069.5166 3072.2010 3077.6529 3115.5688 3128.1432
redmass: 1.6398 4.1403 4.8986 4.1317 3.8808 3.0012 2.3943 3.0480 5.0225 2.3746 2.0714 3.7731 3.5037 3.3731 3.3009 3.6328 1.2666 1.1144 4.0810 3.3942 5.6476 2.2618 3.1144 4.1904 4.5638 3.4283 5.2160 5.1527 7.0167 5.3333 3.3136 11.3471 9.0282 6.6434 4.8823 11.3813 1.0658 1.0931 2.2289 1.1619 4.9257 1.4715 1.2211 1.8953 3.8982 2.4408 2.6715 1.1843 1.9080 3.8999 3.5774 2.1322 2.0440 2.7865 1.1229 2.2894 2.1473 2.4384 1.4889 2.0878 2.0213 1.6801 1.2717 1.5667 1.2543 1.3414 1.7278 2.9987 1.4958 1.1668 1.4889 1.0626 1.1020 1.4575 2.3599 1.8431 1.6305 1.4750 1.6305 1.4705 2.4196 1.2152 8.6493 1.1813 1.0937 1.0892 1.0918 1.0662 1.0600 1.0767 1.0742 1.1048 1.0425 1.0790 1.0565 1.0877 6.7863 1.0714 1.0687 1.0593 1.0588 1.0589 1.0586 1.0600 1.0369 1.0588 1.0981 1.1014 1.0984 1.0721 1.1039 1.0842 1.0895 1.0572 1.1048 1.1008 1.0993 1.1010 1.1086 1.0912
irintensity: 0.1656 0.1165 0.1666 0.0205 0.5763 0.4146 0.5258 0.8984 1.2102 0.2350 0.7969 0.1109 0.3774 0.9678 4.1258 1.3869 1.2004 0.0009 1.0107 2.7744 0.4304 5.7356 1.4398 0.6806 4.5595 0.2560 7.3665 0.6770 0.6458 6.8023 2.0127 0.1875 0.1465 11.9827 8.3622 42.1178 13.2756 0.7721 3.4179 3.5691 21.4430 16.1417 1.2181 2.6997 14.5229 3.6939 5.1965 0.7965 3.8781 0.0171 11.6387 7.7558 39.2325 3.7931 0.2962 1.3879 17.1484 22.6661 18.3429 12.5272 24.3961 0.3849 20.2512 2.3686 0.6928 0.0533 11.0934 15.9905 12.8166 0.1107 6.4604 0.2790 0.3325 24.5184 8.9780 14.0804 0.9107 3.5913 0.9330 6.4037 8.3828 11.1078 28.2239 2.1071 19.0532 8.6412 16.4079 1.3638 13.1773 0.1638 1.5887 10.2474 12.5938 3.2842 9.9609 21.1812 29.6608 53.8183 61.5070 218.9326 2.1562 2.7281 67.4829 27.2687 35.9528 55.8551 0.0085 0.0232 29.6197 49.8173 9.5193 11.7793 48.3220 9.0741 76.7008 92.5606 53.1689 30.9898 17.3532 14.5971
temp: 298.150 k
press: 1.00000 atm
elementType: 16 16 7 7 7 6 6 6 6 6 6 6 6 6 6 6 6 6 6 1 1 1 1 1 1 1 1 1 1 1 1 1 1 1 1 1 1 1 1 1 1 1
symmnumber: 1
zpe: 915196.6 jmol-1
zpe.correction: 0.348580 hartree
zpe.thermalcorrener: 0.369524 hartree
zpe.thermalcorrenthalpy: 0.370468 hartree
zpe.thermalcorrgfe: 0.296104 hartree
zpe.sumelectzpe: -1506.123329 hartree
zpe.sumelectthermal: -1506.102385 hartree
zpe.sumelectthermalent: -1506.101441 hartree
zpe.sumelectthermalfe: -1506.175805 hartree
dipole: -1.5497 -2.3643 0.8055
dipole: 2.9394
quadrupole: -118.0980 -129.9859 -132.3368
quadrupole: -6.4844 4.6888 0.3340
quadrupole: 8.7089 -3.1790 -5.5299 -6.4844 4.6888 0.3340
hfenergy: -1506.4719092 hartree
pointgroup: C01 [X(C14H23N3S2)]
dipole: 0.7003275 0.8498207 -0.3532056 debye
polarizability: 278.2717632|-19.0346372|197.5461857|-17.9297707|-54.1723229|177.1632714 unknown
InChI: InChI=1S/C14H23N3S2/c1-3-4-5-6-10-18-14-13(15-19-16-14)12-8-7-9-17(2)11-12/h8H,3-7,9-11H2,1-2H3
charge 0 multiplicity 1
42 atoms
S  0.864582 0.402182 -0.005382
S  -1.27577 -2.357804 2.497473
N  -4.789579 1.826853 0.060364
N  -2.444681 -1.192473 1.821333
N  0.141479 -1.641881 1.643536
C  -4.06345 2.994295 -0.481857
C  -3.939526 0.991783 0.932612
C  -2.935114 2.50769 -1.41025
C  -2.566999 0.716343 0.331034
C  -2.131489 1.399092 -0.770829
C  5.008761 -0.444997 0.078987
C  3.655912 0.238944 -0.238286
C  6.203944 0.24693 -0.615353
C  -1.782527 -0.340441 1.00089
C  -6.06199 2.177907 0.714227
C  2.489911 -0.478178 0.458081
C  7.557986 -0.436537 -0.316278
C  -0.322145 -0.606106 0.925513
C  8.747969 0.257661 -1.013347
H  -4.776584 3.622278 -1.046442
H  -3.628814 3.631401 0.332579
H  -3.789899 1.456684 1.944948
H  -4.447255 0.027656 1.115981
H  -3.371415 2.141137 -2.361763
H  -2.26413 3.350201 -1.673812
H  -1.175014 1.145989 -1.243394
H  5.173515 -0.448949 1.176201
H  4.967235 -1.508041 -0.236172
H  3.496941 0.241102 -1.335082
H  3.695845 1.298428 0.083859
H  6.25189 1.308835 -0.295868
H  6.035342 0.258513 -1.712445
H  -5.933775 2.822054 1.621822
H  -6.585201 1.25595 1.025984
H  -6.711904 2.715242 0.000659
H  2.389053 -1.528395 0.140539
H  2.568892 -0.450717 1.55689
H  7.725855 -0.448994 0.780027
H  7.50843 -1.497628 -0.635339
H  9.703143 -0.249762 -0.784861
H  8.619246 0.25675 -2.112279
H  8.83873 1.311204 -0.687797
