program: Gaussian 09
title: 000131459
version: EM64L-G09RevD.01
frameworkgroup: C1[X(C12H19N3S2)]
method: RPBEPBE
basis: SDD
operation: Freq
keyword: #p
keyword: freq=noraman
keyword: PBEPBE/SDD
title: #p freq=noraman PBEPBE/SDD
converged: YES YES NO NO
title: Mulliken charges:
elementType: S S N N N C C C C C C C C C C C C H H H H H H H H H H H H H H H H H H H
charge: 0.177269 0.493769 -0.085065 -0.449900 -0.397700 -0.393607 -0.454614 -0.431777 0.359963 -0.340520 0.177195 -0.620507 -0.268638 -0.369674 -0.618381 -0.332646 -0.682533 0.217999 0.188945 0.194282 0.275339 0.234084 0.205587 0.238639 0.225791 0.227852 0.187900 0.211668 0.212137 0.276233 0.291544 0.197487 0.213233 0.220356 0.207745 0.210545
chargesum: 0.00000
title: Mulliken charges with hydrogens summed into heavy atoms:
elementType: S S N N N C C C C C C C C C C C C
charge: 0.177269 0.493769 -0.085065 -0.449900 -0.397700 0.013336 0.015007 0.007894 0.359963 -0.101881 0.177195 0.021035 -0.268638 0.054130 -0.050604 0.078074 -0.043886
polarizability: 2.36062958e+02 -6.91411092e-01 2.26490438e+02 -6.65618551e+00 1.38147443e+01 1.16095659e+02
1716.lowfreq: -10.1090 -3.7696 -0.0003 0.0013 0.0016 5.4198 7.0617 22.2952 42.5317
frequency: 6.8793 21.9447 42.4795 55.2830 77.6300 80.2216 113.8939 132.5513 147.8837 171.9079 181.4993 211.6163 222.8564 234.9534 240.7908 261.3696 283.4768 307.0455 331.5454 354.6290 402.8112 424.2321 448.6613 474.2551 482.4603 509.6621 544.7810 598.5333 635.8863 658.6259 702.0052 715.3314 740.3178 765.1437 785.4309 802.5699 863.3416 871.2138 909.1883 918.0873 937.9462 951.0793 990.2706 1015.1943 1040.0474 1049.1483 1065.0614 1068.0782 1082.5678 1093.1505 1111.2551 1116.0136 1143.5512 1188.3561 1190.8547 1198.8839 1227.8865 1253.3746 1259.7305 1276.7317 1285.9749 1293.1643 1305.0902 1318.2156 1332.8295 1343.8149 1358.4914 1367.9072 1388.0317 1390.2871 1419.0605 1431.6980 1436.2714 1439.9124 1456.9868 1458.1010 1464.0679 1472.9409 1478.4201 1478.6755 1481.4430 1486.1467 1656.7166 2811.9340 2836.3514 2857.1142 2968.0307 2970.1424 2973.9140 2979.0089 3010.7754 3017.3555 3018.1348 3029.9319 3033.8935 3035.5945 3042.8614 3070.8327 3075.9298 3077.0963 3114.7041 3126.5954
redmass: 3.6789 4.4702 4.3242 1.9048 3.2739 3.1627 3.8239 4.9169 3.5005 2.6094 5.0484 2.1903 1.3799 1.3857 1.7930 3.0488 3.0740 5.2181 2.3681 2.9264 6.0754 4.6109 5.0125 5.5100 4.0165 5.2624 3.2609 5.6699 5.9510 8.8823 4.8071 11.5275 1.1742 2.2242 4.7764 1.7020 1.4888 1.3938 3.8550 1.3558 2.4422 2.7207 1.8829 2.6572 2.1263 2.0187 1.5683 1.5343 2.2662 2.2908 2.0631 1.3702 2.0284 1.4683 1.2852 1.5521 1.3476 1.7303 4.1950 1.2530 1.4779 1.1927 1.2407 2.5396 1.9067 1.6357 1.5856 1.4586 2.4382 1.2130 8.4119 1.1927 1.0908 1.0940 1.0828 1.0749 1.0612 1.0577 1.0428 1.0951 1.0665 1.0783 6.8068 1.0714 1.0690 1.0587 1.0592 1.0603 1.0368 1.0609 1.0969 1.0982 1.0723 1.0842 1.0833 1.0895 1.0775 1.1010 1.0992 1.1010 1.1082 1.0914
irintensity: 0.0532 0.2490 0.3725 0.7256 0.5320 0.9403 0.9378 1.2952 0.7048 1.5315 0.3045 2.4018 0.5630 2.0785 0.8467 1.1228 1.2024 0.7808 5.8453 2.2241 1.4390 3.8136 0.4483 1.1838 4.0756 6.9515 2.1279 1.1099 2.3449 0.0897 8.8860 42.5070 13.7454 3.2379 22.2361 0.7122 15.3052 8.4847 12.6329 9.7409 3.9540 4.6564 3.9839 6.5562 11.0799 39.1567 3.3751 2.4501 24.9962 27.1887 5.8546 2.2701 25.4016 4.5072 18.3576 2.6639 2.5295 10.7936 11.1998 15.4232 6.1070 14.3044 5.1426 11.4650 14.8855 1.1498 2.0624 5.7440 8.8258 11.5459 22.5451 2.7207 17.0167 18.4172 17.0378 5.9616 12.1227 4.2940 12.8178 9.8874 10.7620 15.9985 29.4422 54.2675 64.8246 213.0194 7.9977 27.0891 47.6930 54.0659 3.1197 29.8749 49.5229 12.6477 6.2339 46.2628 19.8608 76.1916 42.9762 31.2277 12.6461 14.0563
temp: 298.150 k
press: 1.00000 atm
elementType: 16 16 7 7 7 6 6 6 6 6 6 6 6 6 6 6 6 1 1 1 1 1 1 1 1 1 1 1 1 1 1 1 1 1 1 1
symmnumber: 1
zpe: 769118.8 jmol-1
zpe.correction: 0.292942 hartree
zpe.thermalcorrener: 0.311839 hartree
zpe.thermalcorrenthalpy: 0.312783 hartree
zpe.thermalcorrgfe: 0.242379 hartree
zpe.sumelectzpe: -1427.676722 hartree
zpe.sumelectthermal: -1427.657825 hartree
zpe.sumelectthermalent: -1427.656881 hartree
zpe.sumelectthermalfe: -1427.727285 hartree
dipole: 1.3624 -2.5643 0.6334
dipole: 2.9720
quadrupole: -105.0392 -116.8290 -119.2028
quadrupole: 4.0966 -3.9931 0.7477
quadrupole: 8.6511 -3.1387 -5.5125 4.0966 -3.9931 0.7477
hfenergy: -1427.969664 hartree
pointgroup: C01 [X(C12H19N3S2)]
dipole: 0.5414015 1.0015345 0.2665418 debye
polarizability: 232.3483302|-9.9494608|196.9161395|19.2301742|49.7898132|149.3845848 unknown
InChI: InChI=1S/C12H19N3S2/c1-3-4-8-16-12-11(13-17-14-12)10-6-5-7-15(2)9-10/h6H,3-5,7-9H2,1-2H3
charge 0 multiplicity 1
36 atoms
S  1.833654 0.151122 0.345936
S  0.064463 -3.029384 -1.93781
N  -3.836598 1.234998 -0.363522
N  -1.2171 -1.862131 -1.512079
N  1.363603 -2.128543 -1.072301
C  -3.211994 2.481699 0.126505
C  -2.871063 0.35371 -1.050573
C  -2.17133 2.141382 1.21018
C  -1.560129 0.205031 -0.288944
C  -1.266219 1.012902 0.774103
C  -0.671643 -0.877674 -0.757204
C  -5.041291 1.462266 -1.179999
C  0.788031 -1.042022 -0.532138
C  4.614157 0.176635 0.809662
C  3.540171 -0.676136 0.117274
C  4.833714 1.572752 0.180503
C  5.970825 2.355028 0.87139
H  -4.002581 3.129144 0.547881
H  -2.716703 3.05508 -0.70074
H  -2.633421 0.717657 -2.087212
H  -3.322443 -0.64692 -1.177977
H  -2.692632 1.8519 2.145321
H  -1.562399 3.036101 1.451515
H  -0.356765 0.850854 1.364963
H  -5.779332 2.045748 -0.601143
H  -5.501297 0.492013 -1.440853
H  -4.834997 2.010874 -2.134754
H  4.376953 0.282963 1.887375
H  5.56441 -0.394221 0.757916
H  3.706282 -0.769462 -0.968377
H  3.45687 -1.686042 0.548699
H  5.063074 1.451454 -0.8974
H  3.893915 2.156508 0.23336
H  6.116323 3.347085 0.406751
H  6.929638 1.806745 0.804321
H  5.749252 2.513784 1.943671
