program: Gaussian 09
title: 000131456
version: EM64L-G09RevD.01
frameworkgroup: C1[X(C22H21N3O4)]
method: RPBEPBE
basis: SDD
operation: Freq
keyword: #p
keyword: freq=noraman
keyword: PBEPBE/SDD
title: #p freq=noraman PBEPBE/SDD
converged: YES YES NO NO
title: Mulliken charges:
elementType: O O O O N N N C C C C C C C C C C C C C C C C C C C C C C H H H H H H H H H H H H H H H H H H H H H
charge: -0.268926 -0.419339 -0.215176 -0.264271 -0.269520 -0.193316 -0.208464 -0.230836 0.472283 0.262906 -0.533300 0.321723 -0.459117 -0.216125 0.121911 -0.293658 -0.301497 -0.670246 -0.381249 0.187552 0.269590 -0.255005 -0.255405 -0.282962 -0.383199 -0.366452 -0.358150 0.327340 -0.537586 0.303924 0.277444 0.281303 0.260541 0.249559 0.244166 0.265621 0.251666 0.224865 0.257425 0.242921 0.231886 0.226511 0.253297 0.267441 0.377280 0.251094 0.241550 0.224488 0.245445 0.222070
chargesum: 0.00000
title: Mulliken charges with hydrogens summed into heavy atoms:
elementType: O O O O N N N C C C C C C C C C C C C C C C C C C C C C C
charge: -0.268926 -0.042059 -0.215176 -0.264271 -0.269520 -0.193316 -0.208464 0.073088 0.472283 0.262906 0.025447 0.321723 -0.198576 0.033434 0.121911 -0.049493 -0.035876 0.063710 -0.138328 0.187552 0.269590 -0.023120 -0.028894 -0.029665 -0.115758 -0.115359 -0.116600 0.327340 0.154417
polarizability: 3.17390699e+02 3.11478918e+01 2.41454939e+02 3.78756551e-01 8.29767919e-01 2.68013590e+02
1716.lowfreq: -6.0353 -0.0004 0.0005 0.0005 5.9472 7.1522 21.1159 23.8381 32.8120
frequency: 21.0374 23.7500 32.7786 34.0678 46.4199 59.3550 66.1611 72.4802 89.9465 92.9819 117.9211 151.6839 154.8970 170.4913 179.3105 201.1020 223.1791 233.8352 234.4422 264.8580 276.3181 282.6889 305.2376 319.2216 321.0016 361.8576 375.2033 394.5180 415.4198 431.4146 441.1965 472.8525 478.8755 490.6585 495.6703 533.9624 537.0058 569.7744 578.1610 589.9369 611.9510 614.8762 627.7612 633.6931 642.1381 672.2146 686.5199 692.6662 705.1377 731.7759 748.6159 753.0390 759.8057 772.9038 792.9092 818.1917 829.8749 836.4958 846.1648 853.8076 865.2078 877.3448 888.1615 911.0648 935.8320 955.0997 965.2128 971.8036 986.1180 1001.9986 1009.8838 1016.5186 1036.9219 1043.1796 1056.8192 1077.4373 1094.2568 1109.0711 1112.9096 1116.0653 1125.5614 1133.9266 1147.1192 1158.1838 1174.7376 1178.5842 1181.0874 1195.3909 1217.7230 1234.3230 1238.9112 1250.6968 1265.9106 1285.5339 1302.0110 1304.1589 1308.3788 1336.9179 1344.3843 1357.9650 1368.0696 1372.6726 1379.0318 1420.8550 1421.6162 1432.7923 1434.6207 1437.0286 1443.2635 1466.3311 1468.1113 1468.9106 1473.4476 1491.8336 1498.7417 1499.8856 1545.1836 1555.9583 1572.9718 1581.4259 1605.3849 1618.3461 1676.6511 2947.1602 2962.2987 3014.6487 3040.6286 3043.0162 3051.4434 3077.0869 3100.1691 3125.9845 3135.2589 3147.7953 3148.3378 3150.7207 3162.6016 3167.3871 3172.3787 3174.8697 3208.9551 3223.6710 3244.5885 3512.6350
redmass: 10.7516 6.4716 4.8049 5.6891 4.3212 4.6438 5.4453 4.8837 5.0831 3.5030 3.8752 4.0031 5.5518 4.5100 4.8958 4.8936 2.4282 1.3453 1.3722 3.6602 4.6771 4.7787 4.2408 4.0186 5.6027 5.9741 5.3737 4.4845 2.9502 4.3719 5.3647 3.7320 3.6193 3.2304 2.6777 3.3510 3.7784 4.5706 5.0675 4.7909 3.4672 3.4968 5.4873 3.2316 2.0559 4.3332 4.7045 1.2293 4.7779 4.1208 3.0804 1.9057 2.9506 5.4676 1.4390 1.2537 3.5413 2.0127 1.5707 3.6651 1.3796 4.5995 3.7939 2.7857 1.3660 1.3954 1.3635 1.3147 8.6772 2.8830 2.1644 3.7533 2.7531 1.7779 1.9435 2.0723 2.7560 1.4266 1.2601 1.3493 2.2558 1.7203 1.9912 1.3316 1.2615 1.2571 1.2861 1.7679 1.7608 3.0246 1.7817 2.0196 2.6166 2.4510 1.9160 1.3335 1.7846 3.3482 2.2257 4.2068 3.4248 2.6654 4.6495 3.3644 3.1760 1.5800 1.2176 1.1769 1.5826 4.1888 1.0499 1.1054 1.0786 2.6556 2.4090 1.0884 9.8216 6.3274 7.0517 7.5489 6.2661 6.3478 8.4450 1.0440 1.0327 1.0636 1.0903 1.0855 1.1040 1.0938 1.1003 1.0997 1.0853 1.0877 1.0882 1.0894 1.0938 1.0959 1.0971 1.1004 1.0906 1.0976 1.1077 1.0640
irintensity: 0.9797 1.0877 1.0238 0.2245 0.2096 0.1091 0.6747 2.5946 0.3828 3.0582 6.8995 0.9611 3.2706 1.1367 3.3910 0.3881 2.2689 0.8301 0.1208 0.8424 4.9038 0.4974 1.6353 1.6660 5.7228 4.3040 2.5581 0.3602 0.4450 1.7984 0.9788 17.5906 5.3119 1.1154 36.7411 14.0039 36.4775 13.6343 26.3759 4.7708 42.7208 8.7722 7.9763 24.4602 75.9817 17.4141 12.6639 93.1997 18.4239 4.7946 22.8814 11.6246 97.0955 11.5679 18.1349 3.1677 8.1460 55.9962 4.1369 4.7945 2.0351 4.9876 0.2869 17.9783 3.6381 1.5503 2.9897 0.7570 56.6178 28.8056 31.1372 17.2016 267.2459 15.6205 7.0901 18.8872 12.8899 13.0863 0.1655 14.0177 85.7745 20.5867 55.4823 1.2588 31.2624 156.4125 7.4804 19.2201 2.9173 164.9091 8.2594 23.3896 180.3456 137.0013 93.4379 5.5898 172.2258 14.8543 16.3985 48.7612 40.6023 54.9342 33.3913 3.0625 0.7727 5.0662 17.3895 8.8908 26.1963 4.9180 13.5376 18.0669 52.0160 140.5818 47.4838 30.8708 147.5761 3.5160 9.2347 53.4149 38.0819 147.9725 179.8197 84.3802 77.6740 10.9340 21.4002 20.4498 44.3100 3.1082 13.1872 25.8373 2.2269 4.1962 7.2413 10.8184 21.1493 13.6048 3.5597 11.7833 3.6548 0.9314 1.6577 22.4846
temp: 298.150 k
press: 1.00000 atm
elementType: 8 8 8 8 7 7 7 6 6 6 6 6 6 6 6 6 6 6 6 6 6 6 6 6 6 6 6 6 6 1 1 1 1 1 1 1 1 1 1 1 1 1 1 1 1 1 1 1 1 1
symmnumber: 1
zpe: 1020351.2 jmol-1
zpe.correction: 0.388631 hartree
zpe.thermalcorrener: 0.414566 hartree
zpe.thermalcorrenthalpy: 0.415511 hartree
zpe.thermalcorrgfe: 0.330833 hartree
zpe.sumelectzpe: -1313.973077 hartree
zpe.sumelectthermal: -1313.947142 hartree
zpe.sumelectthermalent: -1313.946198 hartree
zpe.sumelectthermalfe: -1314.030876 hartree
dipole: -0.6820 -0.4342 4.4490
dipole: 4.5219
quadrupole: -134.8013 -159.3502 -169.5892
quadrupole: 9.4298 -7.3782 -0.6693
quadrupole: 19.7790 -4.7700 -15.0090 9.4298 -7.3782 -0.6693
hfenergy: -1314.3617084 hartree
pointgroup: C01 [X(C22H21N3O4)]
dipole: -0.2795921 0.141282 1.7512372 debye
polarizability: 316.5105329|31.7871523|243.5322935|-5.0258884|5.541718|266.8164013 unknown
InChI: InChI=1S/C22H21N3O4/c1-23-17-6-3-4-7-19(17)25(22(28)15-9-11-16(29-2)12-10-15)20(14-21(26)27)18-8-5-13-24(18)23/h3-13,20,26H,14H2,1-2H3
charge 0 multiplicity 1
50 atoms
O  0.488578 0.217245 -2.73496
O  -3.722247 3.286859 -0.827281
O  -1.705115 2.911952 -1.915754
O  5.828187 -0.57088 0.732035
N  -0.567305 0.300726 -0.658678
N  -2.226477 -1.898245 0.215063
N  -2.354426 -1.072993 1.352817
C  -1.870495 0.02578 -1.359181
C  -2.195216 -1.423608 -1.108545
C  -0.571207 0.613519 0.741423
C  -2.992677 1.008257 -0.963038
C  -1.378424 -0.099301 1.700986
C  -2.178394 -2.547555 -1.94276
C  -2.257247 -3.299025 0.224859
C  0.591468 0.221352 -1.46716
C  -2.244909 -3.721232 -1.110545
C  0.228079 1.696202 1.188853
C  -3.471335 -1.406472 2.251331
C  -1.279533 0.277655 3.071789
C  -2.690492 2.45542 -1.302003
C  1.939149 0.069855 -0.821996
C  0.308269 2.056445 2.547213
C  -0.44728 1.332208 3.494719
C  2.172756 -0.738119 0.324666
C  3.049478 0.651915 -1.479949
C  3.475661 -0.93786 0.807183
C  4.362048 0.479883 -0.994423
C  4.574904 -0.318898 0.158095
C  7.001882 0.030788 0.092723
H  -1.639833 0.15511 -2.4311
H  -3.912677 0.718818 -1.505974
H  -3.247006 0.951259 0.109195
H  -2.084115 -2.519304 -3.027176
H  -2.297996 -3.860509 1.155412
H  -2.261514 -4.757007 -1.445495
H  0.784133 2.262084 0.435623
H  -3.856654 -0.484506 2.721243
H  -3.193741 -2.117885 3.056888
H  -4.276496 -1.858717 1.649704
H  -1.848741 -0.281259 3.820215
H  0.94139 2.894263 2.855115
H  -0.394769 1.583081 4.559635
H  1.336725 -1.229868 0.830904
H  2.870035 1.232551 -2.390701
H  -3.5108 4.230493 -1.065073
H  3.669053 -1.567783 1.680458
H  5.196979 0.953692 -1.519014
H  7.123296 -0.33097 -0.946594
H  7.857913 -0.29494 0.701558
H  6.939436 1.136321 0.096597
