program: Gaussian 09
title: 000131454
version: EM64L-G09RevD.01
frameworkgroup: C1[X(C17H21N5O8)]
method: RPBEPBE
basis: SDD
operation: Freq
keyword: #p
keyword: freq=noraman
keyword: PBEPBE/SDD
title: #p freq=noraman PBEPBE/SDD
converged: YES YES NO NO
title: Mulliken charges:
elementType: O O O O O O O O N N N N N C C C C C C C C C C C C C C C C C H H H H H H H H H H H H H H H H H H H H H
charge: -0.233885 -0.373030 -0.523453 -0.459582 -0.439093 -0.268226 -0.159466 -0.216345 -0.209031 -0.435907 -0.025910 -0.050697 -0.661779 -0.105836 -0.167444 -0.182614 -0.082303 -0.164782 -0.496282 -0.052000 -0.055714 -0.195830 -0.269094 0.225697 0.372961 -0.252738 -0.167107 -0.503816 0.016197 0.143666 0.253026 0.265875 0.266784 0.231363 0.242234 0.268704 0.265624 0.277242 0.250387 0.280055 0.268291 0.387726 0.364022 0.363814 0.265885 0.317373 0.233412 0.238827 0.228293 0.340743 0.383762
chargesum: 0.00000
title: Mulliken charges with hydrogens summed into heavy atoms:
elementType: O O O O O O O O N N N N N C C C C C C C C C C C C C C C C C
charge: -0.233885 -0.373030 -0.135727 -0.095560 -0.075279 -0.268226 -0.159466 -0.216345 -0.209031 -0.118535 -0.025910 -0.050697 0.062727 0.147191 0.098430 0.084170 0.149059 0.077453 0.038046 0.225242 0.194673 0.084225 -0.000803 0.225697 0.372961 0.013147 -0.167107 0.196716 0.016197 0.143666
polarizability: 3.12038308e+02 -4.56514379e+00 2.57350965e+02 1.77929568e+01 1.62931570e+00 1.70473503e+02
1716.lowfreq: -12.6740 -5.1409 0.0007 0.0008 0.0009 4.6073 13.2505 21.9864 36.8334
frequency: 12.9212 21.8736 36.8065 38.7613 54.5233 60.6314 65.7001 77.7937 90.3234 99.2290 112.9124 127.6428 137.8200 156.3338 165.7731 189.5399 193.8989 200.8460 221.0148 236.7568 248.9762 275.8032 282.4170 293.8223 297.2581 307.9361 319.5961 347.5192 352.2761 360.1820 382.6652 386.5610 409.2458 415.9550 424.7362 428.5232 441.5977 465.7707 477.0938 501.6653 530.7912 539.1751 552.1282 576.2960 589.2422 598.8575 625.3747 630.4281 646.1599 655.0732 661.4823 689.7741 694.6746 723.4525 725.9613 739.1679 756.0157 779.9263 780.6258 794.9122 803.4692 822.2671 852.9118 876.7368 888.1740 912.0872 930.1509 942.5825 945.2865 968.4194 975.5761 981.5589 987.4045 997.5519 1009.7452 1030.1163 1032.6608 1047.2923 1056.6249 1068.3964 1082.8612 1084.2352 1097.9600 1109.5446 1115.1107 1117.2574 1141.3566 1144.9394 1176.4860 1189.2772 1196.1628 1198.3840 1210.4970 1219.7722 1230.9818 1254.1132 1255.7782 1271.6785 1276.8577 1280.4557 1283.4292 1301.0255 1305.1849 1312.4021 1330.2216 1333.2879 1340.1557 1345.2149 1354.6215 1362.9412 1371.3337 1383.0404 1396.1323 1408.4311 1426.6584 1435.4141 1459.7350 1462.6016 1473.7877 1519.2954 1539.5194 1618.4426 1629.2175 1629.4555 1655.3931 1685.9100 2944.8744 2968.7866 2969.8631 2994.8378 3015.0988 3017.9692 3040.2629 3049.3817 3051.4111 3063.8105 3106.6446 3126.1431 3162.8647 3193.2560 3224.8720 3349.2468 3387.3963 3535.8225 3539.5991 3587.2083 3648.7030
redmass: 6.6024 6.2502 7.4475 6.6458 5.5578 5.1917 6.3805 3.5618 5.6284 5.4911 5.6356 2.9323 2.9923 1.8292 6.3913 5.9136 5.3402 4.9706 5.1301 4.4082 5.4255 4.8518 5.0211 4.7146 4.9831 4.4223 6.3477 2.2529 5.1478 1.6083 5.2371 4.3133 2.2645 1.3241 2.0648 3.6073 3.6575 6.8754 4.4142 6.6058 3.9411 4.0156 1.1797 5.3667 2.5395 1.9456 3.4794 3.1675 8.1917 4.6999 3.6006 5.5360 4.8125 1.5263 3.0900 1.5901 5.4872 5.4212 4.2544 4.2445 1.6513 6.5052 3.9840 6.6184 5.7306 4.1174 5.4362 2.5851 5.3071 5.1486 1.4360 2.7027 5.7362 2.6494 5.0462 3.9346 2.8713 3.5512 3.1101 4.8606 2.0809 4.0772 2.2761 2.6228 1.3132 1.1654 2.8494 1.3301 1.7905 1.3740 2.3476 1.7040 1.2252 1.4246 1.1633 1.8906 1.3979 1.6995 1.2621 1.3175 1.2613 1.2281 2.1033 1.2400 4.7903 1.2735 1.2592 1.7084 1.3114 1.6027 1.5921 4.6599 1.6143 1.4400 4.4831 1.1565 1.0847 1.0506 1.0513 4.0471 6.6950 10.6057 2.3326 5.9659 1.7989 12.0421 1.0793 1.0760 1.0379 1.0842 1.0842 1.0860 1.0645 1.0883 1.0858 1.1046 1.1028 1.1013 1.0874 1.1075 1.0980 1.0636 1.0649 1.0785 1.0653 1.0663 1.0912
irintensity: 2.1219 0.2446 3.9919 1.8981 1.5455 2.7533 0.9369 3.3103 4.9437 2.6583 3.1151 2.5895 3.5464 4.4531 2.2299 1.8105 1.8908 4.0325 10.7729 4.5324 13.2240 7.3589 5.9462 4.8920 11.4470 3.6195 0.6102 51.7722 7.7545 151.8574 11.4943 15.3515 74.8524 105.1755 84.0994 12.9699 12.4890 4.6490 7.2181 10.8538 22.6423 10.4482 107.8815 24.9010 23.2256 68.3250 33.6183 18.5982 3.3233 10.2412 1.1184 65.5998 24.7509 38.3456 54.5112 79.0372 14.7117 5.7132 6.4346 29.7863 57.7117 32.6201 19.6217 132.8913 31.4822 16.5854 0.1004 46.1049 20.4085 396.9018 10.0240 59.8707 223.5843 20.9105 64.4502 40.5175 30.6658 135.0729 39.8572 44.4808 10.1354 8.7777 117.6343 155.4773 4.8045 3.9317 6.3029 14.5591 25.3882 20.3709 10.0567 5.0145 5.1516 3.0721 25.5858 11.0625 5.3663 1.3777 11.1728 4.1351 4.3659 13.2539 28.9351 19.0780 76.0481 8.7608 18.3956 9.7616 34.5648 62.6353 31.8068 113.9564 20.0511 12.5063 14.7452 7.2589 9.3023 13.5566 11.2176 130.2342 285.9837 641.7012 45.1497 15.9878 272.3208 177.5760 21.1491 37.8707 44.4083 8.5536 10.7600 34.3053 5.7829 31.1358 7.1045 34.7840 10.3042 18.4338 0.1275 4.8070 0.2001 406.7212 316.2082 56.2489 21.4764 17.9185 98.4389
temp: 298.150 k
press: 1.00000 atm
elementType: 8 8 8 8 8 8 8 8 7 7 7 7 7 6 6 6 6 6 6 6 6 6 6 6 6 6 6 6 6 6 1 1 1 1 1 1 1 1 1 1 1 1 1 1 1 1 1 1 1 1 1
symmnumber: 1
zpe: 1017626.4 jmol-1
zpe.correction: 0.387593 hartree
zpe.thermalcorrener: 0.415740 hartree
zpe.thermalcorrenthalpy: 0.416684 hartree
zpe.thermalcorrgfe: 0.327587 hartree
zpe.sumelectzpe: -1533.657594 hartree
zpe.sumelectthermal: -1533.629447 hartree
zpe.sumelectthermalent: -1533.628503 hartree
zpe.sumelectthermalfe: -1533.717600 hartree
dipole: 9.0798 -11.0831 5.5727
dipole: 15.3731
quadrupole: -224.8688 -180.6558 -173.3197
quadrupole: 43.4830 -12.4869 3.0370
quadrupole: -31.9207 12.2923 19.6284 43.4830 -12.4869 3.0370
hfenergy: -1534.0451869 hartree
pointgroup: C01 [X(C17H21N5O8)]
dipole: 3.7698369 -4.1569521 2.2559881 debye
polarizability: 312.0163065|-1.6436402|257.0575902|19.0294849|1.9418965|170.7888789 unknown
InChI: InChI=1S/C17H21N5O8/c1-28-16-11(25)9(23)10(24)12(30-16)15(27)29-7-3-2-6(4-7)22-5-19-8-13(22)20-17(18)21-14(8)26/h2-3,5-7,9-12,16,20,23-25H,4,18H2,1H3
charge 0 multiplicity 1
51 atoms
O  3.641944 -0.481014 -1.187718
O  0.740394 -1.740689 0.622032
O  1.313591 0.681324 1.581528
O  2.751588 3.098756 0.835895
O  5.284036 2.776293 -0.389558
O  5.557344 -0.002615 0.194937
O  1.898621 -2.631364 -1.201668
O  -5.136895 3.006536 -0.936382
N  -3.514351 -1.33968 -0.260704
N  -2.060977 0.573723 0.482664
N  -5.257825 -0.101057 -1.087841
N  -3.007885 2.763191 0.032284
N  -0.887616 2.549188 1.023808
C  2.137579 0.735819 0.355384
C  3.270046 1.742157 0.624032
C  2.789427 -0.63599 -0.002555
C  4.195129 1.839618 -0.601789
C  -2.719951 -2.533421 0.08679
C  -1.315628 -2.621195 -0.612749
C  -0.280345 -2.864269 0.520895
C  4.776161 0.451472 -0.917263
C  -2.397274 -2.636548 1.57426
C  -1.074061 -2.834432 1.804995
C  1.809715 -1.768466 -0.318337
C  -3.198739 0.004036 -0.069699
C  -4.790033 -1.335245 -0.888152
C  -4.266395 0.763451 -0.579104
C  6.496983 -1.087776 -0.143411
C  -4.221759 2.241594 -0.529686
C  -2.031763 1.995431 0.492328
H  1.515512 1.083068 -0.494779
H  3.852891 1.404424 1.504608
H  3.404987 -0.95687 0.868675
H  3.57797 2.14508 -1.474624
H  -3.345857 -3.393465 -0.217522
H  -1.284831 -3.435574 -1.352818
H  -1.091886 -1.687362 -1.155356
H  0.308925 -3.784802 0.36648
H  5.343357 0.444766 -1.865147
H  -3.182522 -2.580764 2.33378
H  -0.603607 -2.973867 2.781871
H  0.938993 -0.244147 1.642215
H  2.36013 3.153898 1.742967
H  4.877001 3.620013 -0.059934
H  -5.292258 -2.262673 -1.156669
H  -1.311715 0.023551 0.905231
H  5.963253 -1.96456 -0.555799
H  6.995629 -1.354627 0.800071
H  7.248086 -0.728924 -0.87275
H  -0.847636 3.56562 1.014552
H  -0.07778 1.984288 1.316931
