program: Gaussian 09
title: 000131451
version: EM64L-G09RevD.01
frameworkgroup: C1[X(C15H19NO3)]
method: RPBEPBE
basis: SDD
operation: Freq
keyword: #p
keyword: freq=noraman
keyword: PBEPBE/SDD
title: #p freq=noraman PBEPBE/SDD
converged: YES YES NO NO
title: Mulliken charges:
elementType: O O O N C C C C C C C C C C C C C C C H H H H H H H H H H H H H H H H H H H
charge: -0.320252 -0.257376 -0.280741 -0.152038 0.394513 -0.363632 -0.383795 0.243289 0.191099 -0.477164 0.127221 -0.658066 -0.658924 -0.520464 -0.355610 0.354550 -0.391241 -0.240451 -0.685078 0.213516 0.244460 0.225317 0.238170 0.249862 0.243971 0.213597 0.216383 0.249232 0.215664 0.220895 0.271285 0.282203 0.254410 0.209563 0.209817 0.207821 0.234006 0.233990
chargesum: 0.00000
title: Mulliken charges with hydrogens summed into heavy atoms:
elementType: O O O N C C C C C C C C C C C C C C C
charge: -0.320252 -0.257376 -0.280741 -0.152038 0.394513 0.094344 0.079691 0.243289 0.191099 -0.227302 0.127221 0.015885 0.026867 -0.249179 -0.073407 0.354550 -0.136831 0.178928 -0.009261
polarizability: 2.68109791e+02 -2.88360806e+00 2.14797106e+02 3.87537186e-01 -4.89432123e+00 1.03358696e+02
1716.lowfreq: -9.2766 -2.7007 -0.0008 -0.0006 -0.0004 5.5335 24.0023 44.8154 50.5833
frequency: 23.0459 44.7295 50.5247 62.2505 74.2887 95.9596 102.1722 125.2542 130.7798 162.3938 185.1924 213.0469 228.1090 242.1747 251.8210 259.1476 279.5649 296.7593 299.4407 348.6505 373.2157 436.0074 452.8791 464.3590 484.3043 516.6026 527.8735 595.2335 600.3058 637.5987 647.0528 657.5758 702.6050 736.8366 743.5017 776.3258 785.5002 806.8342 820.3513 839.4099 843.9655 852.4123 863.6791 910.8712 931.6643 978.9770 988.0789 1018.8725 1033.0652 1067.7188 1078.5988 1079.0543 1096.4890 1115.4495 1132.9274 1135.4828 1145.1513 1156.3155 1199.7452 1229.1835 1253.7340 1260.1186 1263.3964 1276.5096 1296.5267 1339.0823 1342.8416 1356.2986 1367.4040 1382.6086 1388.2999 1390.9438 1400.4061 1403.1256 1436.6483 1461.0978 1465.4938 1468.4707 1469.0240 1474.2065 1480.5288 1482.3041 1485.0656 1492.0285 1495.5618 1549.8600 1579.9785 1614.7234 1638.2513 2955.2480 2984.2733 2988.1005 2998.0821 2999.9431 3007.7425 3014.0794 3052.1129 3070.2337 3085.1676 3086.5047 3095.3407 3096.8430 3102.7470 3107.6640 3153.1332 3175.5020 3178.4468 3192.3563
redmass: 3.1422 3.0252 3.9599 3.6994 3.1965 2.8687 2.4435 4.4297 3.2074 2.8597 2.9742 1.0553 1.4479 1.2324 5.2595 5.8714 2.9223 3.2092 5.9536 2.6861 3.8412 4.5403 3.1464 4.0866 4.2687 4.5050 4.3046 5.8092 5.1063 8.3832 5.0110 2.4690 5.0599 4.5857 2.3992 1.2309 1.1999 1.7090 1.2835 3.1619 1.4535 1.6151 3.1634 3.2141 2.1666 2.9355 1.3235 2.8878 2.6524 3.6954 2.0953 1.9065 1.6990 2.1578 1.5748 1.4411 1.8900 1.8925 2.8522 3.0349 1.4710 2.0404 1.1436 1.4854 1.4670 2.0699 1.4349 1.4610 1.3846 1.2305 1.4173 2.5978 1.4645 2.6981 5.0491 1.0397 1.0641 1.0631 1.0622 1.3064 1.0873 1.2988 1.1003 1.2751 1.2222 8.5918 7.5362 6.9215 7.6801 1.0553 1.0357 1.0356 1.0363 1.0607 1.0647 1.1076 1.1028 1.0993 1.0998 1.0979 1.0988 1.1015 1.1021 1.1014 1.0885 1.0960 1.0922 1.0909
irintensity: 0.3356 0.1409 0.0362 0.3541 0.5179 0.1169 0.8110 0.1057 6.2676 2.2079 1.6436 0.7772 1.7807 0.4725 1.1079 4.8575 1.3828 0.3499 0.8510 0.5019 7.9974 3.6920 3.1748 8.0716 4.8396 7.5294 2.2875 1.1129 10.1882 1.6598 4.9039 5.8377 0.6445 3.2422 3.4893 18.1581 8.1853 41.2009 37.3256 6.9965 0.1727 48.1879 7.2410 5.9040 0.1982 96.2330 0.5221 18.4778 42.2232 112.5304 10.4664 20.6328 17.6172 2.1746 11.6118 4.5167 63.5624 176.4260 12.4449 96.4327 98.7290 43.7273 0.1792 31.4157 45.5063 215.2894 117.3707 42.5943 11.0396 13.3044 77.8591 110.2552 12.8766 56.2707 50.3135 12.0265 1.6919 13.7074 10.7131 40.3998 1.9781 10.0948 22.2484 14.8906 4.3447 166.1004 61.5650 740.3393 383.4982 30.4404 27.3730 25.1306 26.9286 39.0718 45.2017 35.0654 5.2044 7.8891 38.6840 36.8189 25.3530 28.6012 44.2132 32.7106 0.0742 6.4143 5.1096 8.4076
temp: 298.150 k
press: 1.00000 atm
elementType: 8 8 8 7 6 6 6 6 6 6 6 6 6 6 6 6 6 6 6 1 1 1 1 1 1 1 1 1 1 1 1 1 1 1 1 1 1 1
symmnumber: 1
zpe: 817022.2 jmol-1
zpe.correction: 0.311187 hartree
zpe.thermalcorrener: 0.330495 hartree
zpe.thermalcorrenthalpy: 0.331439 hartree
zpe.thermalcorrgfe: 0.262464 hartree
zpe.sumelectzpe: -861.988999 hartree
zpe.sumelectthermal: -861.969691 hartree
zpe.sumelectthermalent: -861.968747 hartree
zpe.sumelectthermalfe: -862.037722 hartree
dipole: 1.0281 -8.0354 0.6686
dipole: 8.1284
quadrupole: -88.1926 -123.2219 -115.8010
quadrupole: -4.2527 -0.0855 0.6281
quadrupole: 20.8792 -14.1501 -6.7291 -4.2527 -0.0855 0.6281
hfenergy: -862.300186 hartree
pointgroup: C01 [X(C15H19N1O3)]
dipole: -0.4908902 -3.1514354 -0.2333885 debye
polarizability: 268.1334946|1.2685042|214.7815154|4.0619229|3.4846989|103.3505825 unknown
InChI: InChI=1S/C15H19NO3/c1-4-16(5-2)15-10-13(17)12-8-7-11(18-6-3)9-14(12)19-15/h7-10H,4-6H2,1-3H3
charge 0 multiplicity 1
38 atoms
O  -0.705701 -0.631032 0.031719
O  4.160788 -0.360217 0.075446
O  -1.021547 3.540074 0.314058
N  -2.985139 -0.924393 0.008821
C  -1.963051 -0.000835 0.061282
C  -2.72863 -2.374959 -0.160946
C  -4.389632 -0.478865 0.134501
C  0.46377 0.166804 0.088547
C  0.390506 1.572729 0.193774
C  -2.083683 1.384023 0.142766
C  -0.930967 2.264837 0.228027
C  -2.550542 -3.117307 1.18182
C  -5.014934 -0.040574 -1.208874
C  1.682356 -0.540696 0.042844
C  1.615738 2.289446 0.254759
C  2.882253 0.205103 0.107521
C  2.84708 1.625788 0.214063
C  4.267753 -1.830088 -0.033983
C  5.756143 -2.165968 -0.043479
H  -3.585078 -2.795759 -0.720801
H  -1.829614 -2.508814 -0.784027
H  -4.964918 -1.321648 0.560145
H  -4.442627 0.343537 0.871266
H  -3.067197 1.856026 0.131019
H  -1.669991 -2.728754 1.72067
H  -3.437155 -2.993661 1.830104
H  -2.403671 -4.199035 1.005593
H  -4.458782 0.805379 -1.647685
H  -5.007341 -0.870783 -1.937899
H  -6.06354 0.274907 -1.058414
H  1.663139 -1.629761 -0.037623
H  1.552423 3.379633 0.333699
H  3.796095 2.167114 0.261478
H  3.752988 -2.299829 0.829431
H  3.771787 -2.164637 -0.9684
H  5.897489 -3.259186 -0.122788
H  6.258875 -1.684793 -0.899472
H  6.239957 -1.816607 0.884338
