program: Gaussian 09
title: 000131450
version: EM64L-G09RevD.01
frameworkgroup: C1[X(C18H27N5O5)]
method: RPBEPBE
basis: SDD
operation: Freq
keyword: #p
keyword: freq=noraman
keyword: PBEPBE/SDD
title: #p freq=noraman PBEPBE/SDD
converged: YES YES NO NO
title: Mulliken charges:
elementType: O O O O O N N N N N C C C C C C C C C C C C C C C C C C H H H H H H H H H H H H H H H H H H H H H H H H H H H
charge: -0.295611 -0.424711 -0.484854 -0.220323 -0.434648 -0.189964 -0.082395 -0.020792 -0.115937 -0.616636 0.041431 -0.439644 -0.451778 -0.167319 -0.051935 -0.183109 -0.078215 -0.403762 -0.402008 -0.381959 -0.466515 -0.320206 -0.301683 0.167699 -0.216832 -0.145866 0.020031 0.176936 0.230549 0.181939 0.198493 0.202679 0.181515 0.264160 0.286844 0.238711 0.252777 0.193421 0.194860 0.194708 0.193979 0.197090 0.184788 0.214999 0.190135 0.215833 0.184351 0.224222 0.224431 0.373912 0.365527 0.263151 0.363531 0.328658 0.345340
chargesum: 0.00000
title: Mulliken charges with hydrogens summed into heavy atoms:
elementType: O O O O O N N N N N C C C C C C C C C C C C C C C C C C
charge: -0.295611 -0.050800 -0.119327 -0.220323 -0.071117 -0.189964 -0.082395 -0.020792 -0.115937 0.057361 0.271980 -0.059212 -0.067583 0.096841 0.234910 0.055602 0.174561 -0.015481 -0.013320 -0.000081 -0.061381 0.079978 0.146970 0.167699 0.046319 -0.145866 0.020031 0.176936
polarizability: 3.10583244e+02 -1.16787035e+01 2.61891595e+02 1.57292292e+01 1.32685284e+01 1.84403382e+02
1716.lowfreq: 0.0004 0.0006 0.0008 3.5539 5.9958 10.5083 17.2699 23.1396 25.8393
frequency: 17.2195 23.1066 25.7560 28.5039 33.5853 55.4154 62.1027 73.3977 84.7732 113.1634 127.2391 136.6257 142.3515 165.9693 179.1059 211.4873 212.0392 219.4406 223.9595 240.3295 258.4393 265.7408 278.1388 288.4766 312.7591 317.7967 339.3116 359.6669 382.4611 390.1462 414.8161 430.4626 432.4173 458.2094 488.5206 500.9689 505.0934 521.9094 525.9413 532.9749 539.8601 552.3590 578.2484 605.3004 638.2522 651.3859 663.3083 690.3227 692.5707 706.2624 745.6650 766.0237 778.6304 781.0487 804.0599 812.1797 823.4879 827.8580 837.9763 863.4699 871.7582 888.4985 910.8880 914.2588 925.0019 935.3832 960.5591 971.5948 977.1166 998.8633 1006.2984 1026.5007 1036.2940 1044.1752 1052.9085 1059.4223 1059.6104 1066.7290 1085.1914 1092.4091 1093.3220 1110.6443 1116.5567 1143.0711 1149.5743 1163.1570 1174.5817 1181.8350 1200.8106 1206.6009 1219.1881 1225.4046 1246.2347 1252.8350 1254.1994 1255.4061 1258.7253 1268.4884 1270.7591 1288.7192 1296.0631 1307.4945 1309.8943 1315.4943 1322.8898 1331.5376 1334.3280 1336.8131 1337.5355 1340.1126 1343.4971 1357.2357 1361.5358 1364.2977 1372.4964 1381.9578 1389.5629 1402.5872 1409.0893 1435.7273 1446.2805 1457.3605 1459.2643 1461.2655 1464.6025 1467.3654 1469.7111 1474.7589 1478.6708 1566.9207 1583.5670 1631.6170 2937.0259 2945.8645 2947.7754 2961.1324 2963.7130 2964.8821 2966.3519 2979.5792 3004.0133 3008.4760 3012.6982 3018.5968 3019.6446 3023.2788 3025.8989 3027.2188 3029.7517 3038.9689 3059.9920 3063.8230 3067.7836 3236.1890 3489.4648 3527.1689 3543.6950 3609.8499 3698.4009
redmass: 3.5734 5.5811 3.6636 5.9459 5.7761 4.8355 6.3415 5.9689 4.8850 3.0262 3.4530 4.5058 6.1298 5.1719 6.7590 1.1937 2.1853 2.1500 4.3860 6.5385 3.6278 2.9816 3.7825 5.3202 4.1129 1.7719 4.6256 5.3051 4.2636 3.8891 2.4279 3.9117 2.5048 3.5531 1.1687 1.2302 1.2046 1.6572 2.6710 5.8992 1.0934 5.5583 4.4823 4.6707 4.7387 6.1782 7.0358 4.3523 5.2334 11.6745 2.9473 3.6518 2.8842 1.4690 2.5560 3.0346 2.2428 4.9441 2.4327 2.7071 3.2305 1.6366 1.6945 2.1055 6.0413 2.2040 3.3445 2.8199 2.6357 2.0507 3.8959 3.2296 2.4958 2.4356 1.7914 1.1050 4.0939 2.8693 3.0491 1.6810 1.9355 2.3585 2.4610 2.3800 1.6614 2.1797 1.3099 1.1944 2.0307 1.4342 1.2894 1.4417 1.3668 1.8400 1.2474 1.5889 1.2644 1.3130 1.3518 1.5391 1.1998 1.8914 1.8685 1.8521 3.3623 2.3238 1.3888 1.2821 1.4519 1.5274 1.5037 1.4003 1.5413 1.5895 1.3868 2.1025 1.2631 1.9827 2.6610 4.1558 1.0899 1.0889 1.0904 1.0910 1.1108 1.0812 4.1697 1.0971 1.1399 3.4853 2.9313 2.5790 1.0689 1.0624 1.0640 1.0607 1.0641 1.0638 1.0635 1.0777 1.0612 1.0869 1.0964 1.0855 1.0969 1.0938 1.1030 1.0863 1.0982 1.1030 1.0872 1.0940 1.1069 1.0980 1.0645 1.0654 1.0443 1.0671 1.1056
irintensity: 0.0861 0.0477 0.1259 0.1118 0.8402 3.5800 3.9471 5.2209 0.4174 6.9440 1.9244 1.6061 1.9061 0.3629 0.9193 151.3147 4.9626 0.1145 3.6158 1.4090 12.9659 3.8114 4.4832 9.4486 7.9326 0.3811 1.8019 1.5571 2.6676 4.9223 0.5765 3.5711 0.3406 1.2877 161.7082 258.3208 132.9976 0.3875 3.4050 4.1251 10.2500 7.4502 5.8955 27.7973 29.2226 2.5476 2.0163 27.4854 46.7861 7.6851 0.6278 2.9050 23.6357 0.0648 9.8141 6.1779 19.5059 26.3104 5.4508 10.2711 45.7020 12.0282 1.3934 2.2006 245.6398 17.7129 53.4864 49.5765 48.8813 17.8320 99.3260 13.6534 11.0262 37.4760 3.9057 2.5210 91.9547 3.4689 37.1995 15.6494 21.0093 25.8966 5.1537 14.7226 28.4258 78.2226 1.7554 24.8468 32.6320 2.2531 1.9947 27.9649 17.5842 105.4131 16.8188 49.0624 2.2634 10.5003 2.5252 39.3602 0.1586 109.8869 181.8983 360.3264 70.7357 25.7241 3.0306 5.8519 3.7339 4.2573 5.6255 6.3356 3.4524 15.9975 27.5743 163.9595 38.1133 77.2087 27.7119 118.2021 5.3685 1.9153 6.2341 8.9601 6.8989 22.4006 66.7870 2.5186 2.5423 163.2104 199.8925 610.6436 57.8379 23.2537 36.3912 35.1527 28.3457 32.1803 21.8598 31.1431 24.1566 37.7384 70.1770 26.9590 67.9488 51.2581 16.5137 5.6145 22.1637 175.2004 18.0630 51.8375 40.7369 0.0399 39.4875 15.3124 116.8289 21.1353 47.2362
temp: 298.150 k
press: 1.00000 atm
elementType: 8 8 8 8 8 7 7 7 7 7 6 6 6 6 6 6 6 6 6 6 6 6 6 6 6 6 6 6 1 1 1 1 1 1 1 1 1 1 1 1 1 1 1 1 1 1 1 1 1 1 1 1 1 1 1
symmnumber: 1
zpe: 1183611.8 jmol-1
zpe.correction: 0.450814 hartree
zpe.thermalcorrener: 0.477830 hartree
zpe.thermalcorrenthalpy: 0.478774 hartree
zpe.thermalcorrgfe: 0.390871 hartree
zpe.sumelectzpe: -1349.831461 hartree
zpe.sumelectthermal: -1349.804445 hartree
zpe.sumelectthermalent: -1349.803500 hartree
zpe.sumelectthermalfe: -1349.891403 hartree
dipole: 1.2217 -0.8626 -1.0159
dipole: 1.8079
quadrupole: -145.2915 -138.8481 -181.7855
quadrupole: -21.6750 -11.1188 11.0594
quadrupole: 10.0168 16.4602 -26.4771 -21.6750 -11.1188 11.0594
hfenergy: -1350.2822745 hartree
pointgroup: C01 [X(C18H27N5O5)]
dipole: 0.4786138 -0.4611935 -0.2532918 debye
polarizability: 311.3107848|-5.0021982|260.2394715|16.6912587|-17.0410328|185.3279653 unknown
InChI: InChI=1S/C18H27N5O5/c19-15-12-16(22-18(21-15)27-7-6-10-4-2-1-3-5-10)23(9-20-12)17-14(26)13(25)11(8-24)28-17/h9-11,13-14,17,24-26H,1-8,19H2
charge 0 multiplicity 1
55 atoms
O  3.420327 -0.622592 1.11445
O  3.522432 -1.557807 -2.467135
O  3.688359 -3.384962 -0.55994
O  -2.294114 0.395989 -1.074922
O  5.494302 -0.39822 2.957761
N  2.421654 0.795657 -0.526177
N  2.47509 3.073074 -0.820467
N  -0.012347 0.406326 -0.780702
N  -1.234187 2.496104 -1.22727
N  -0.174841 4.599905 -1.386283
C  -4.903612 -0.741918 -0.101454
C  -5.840865 -1.948481 -0.369725
C  -5.488962 0.146788 1.027091
C  3.976082 -1.108014 -1.174853
C  2.843059 -0.559812 -0.255894
C  4.577466 -2.2402 -0.299308
C  4.457964 -1.70486 1.143994
C  -6.127614 -2.764984 0.912251
C  -5.772413 -0.665655 2.314416
C  -6.70602 -1.866377 2.03047
C  -4.661166 0.045844 -1.413535
C  5.746687 -1.062262 1.683291
C  -3.57017 1.115865 -1.344303
C  1.092305 1.191734 -0.744988
C  3.201641 1.971809 -0.579365
C  1.151753 2.597446 -0.931644
C  -1.135643 1.143614 -1.026398
C  -0.089311 3.248266 -1.184599
H  -3.924553 -1.136409 0.242314
H  -6.801372 -1.573435 -0.785628
H  -5.391799 -2.602393 -1.144021
H  -4.798032 0.980634 1.260269
H  -6.436484 0.604858 0.668131
H  4.727549 -0.322871 -1.364451
H  1.941707 -1.198081 -0.323731
H  5.620537 -2.48321 -0.580621
H  4.100035 -2.485092 1.842233
H  -6.825356 -3.595597 0.687635
H  -5.18351 -3.226537 1.269188
H  -4.811964 -1.040948 2.724439
H  -6.216106 -0.008864 3.088301
H  -6.864785 -2.45591 2.954652
H  -7.700848 -1.487425 1.715054
H  -4.397306 -0.663741 -2.222605
H  -5.603533 0.547436 -1.720753
H  6.50879 -1.83312 1.894037
H  6.156471 -0.348257 0.933753
H  -3.737576 1.854967 -0.539704
H  -3.471196 1.666827 -2.297258
H  3.11815 -2.458387 -2.333313
H  4.020694 -4.201646 -0.115489
H  4.275681 1.962904 -0.411391
H  4.684068 0.165135 2.840615
H  -1.083082 5.022077 -1.564448
H  0.670163 5.166308 -1.357471
