program: Gaussian 09
title: 000131448
version: EM64L-G09RevD.01
frameworkgroup: C1[X(C20H13N3O)]
method: RPBEPBE
basis: SDD
operation: Freq
keyword: #p
keyword: freq=noraman
keyword: PBEPBE/SDD
title: #p freq=noraman PBEPBE/SDD
converged: YES YES NO NO
title: Mulliken charges:
elementType: O N N N C C C C C C C C C C C C C C C C C C C C H H H H H H H H H H H H H
charge: -0.265301 -0.473512 -0.474991 -0.049103 0.100255 0.061189 0.086435 0.022312 0.177317 0.203591 -0.068826 0.207685 0.195681 0.371045 -0.383787 -0.335439 -0.376132 -0.380785 -0.251485 -0.286269 -0.217693 -0.213123 -0.355805 -0.514723 0.297851 0.295772 0.270463 0.266762 0.231638 0.230831 0.224047 0.226486 0.224158 0.224175 0.246619 0.247539 0.235123
chargesum: 0.00000
title: Mulliken charges with hydrogens summed into heavy atoms:
elementType: O N N N C C C C C C C C C C C C C C C C C C C C
charge: -0.265301 -0.175661 -0.179219 -0.049103 0.100255 0.061189 0.086435 0.022312 0.177317 0.203591 -0.068826 0.207685 0.195681 0.371045 -0.113324 -0.068677 -0.144494 -0.149954 -0.027438 -0.059783 0.006465 0.011052 -0.355805 0.214557
polarizability: 4.57861092e+02 -1.17174884e+01 2.74335587e+02 2.07404252e-02 -1.39877261e-01 9.39043287e+01
1716.lowfreq: -7.1917 -4.8394 -3.3287 -0.0010 -0.0007 0.0007 12.9777 47.6824 70.6628
frequency: 12.8156 47.6822 70.6619 97.1683 118.0463 118.5838 131.6906 153.0109 197.5845 223.2202 245.9486 262.5487 274.3430 276.0395 295.3155 337.9302 350.3578 371.8392 377.2190 394.4560 430.3390 434.7976 455.8192 475.1508 488.6497 515.4413 525.4868 544.2047 566.6393 571.9365 614.7491 619.9672 638.8890 652.4580 660.0187 680.6469 748.5100 756.3065 758.2014 764.1496 771.9735 814.2630 826.1033 834.6227 860.8844 861.9674 874.7458 888.1442 932.9647 942.7304 944.5954 981.9903 983.8907 1006.5834 1017.1889 1026.3600 1079.1125 1105.4107 1108.4463 1124.7339 1154.6252 1163.1706 1168.2779 1172.1635 1191.7460 1233.2251 1248.2010 1265.2228 1268.7275 1317.3673 1332.8227 1347.8894 1358.5597 1394.3564 1406.1437 1419.1710 1431.2464 1436.7142 1450.7018 1456.7197 1466.6915 1467.2785 1475.2529 1482.7435 1488.4476 1570.3867 1584.4821 1590.2361 1627.9421 1629.7098 1659.5918 2150.7260 2995.4142 3101.6287 3126.9076 3127.3278 3127.7173 3141.2509 3142.1543 3159.4818 3159.6302 3180.4438 3187.3835 3615.7304 3621.4090
redmass: 3.5254 5.6175 5.1664 4.4006 5.4154 5.5216 7.0390 5.3792 5.3606 1.8160 1.8212 5.1813 5.1478 5.1583 3.4840 7.2665 5.7523 5.8645 1.8419 2.8143 5.9752 3.0627 3.4767 1.1685 8.1922 6.3510 8.4971 6.9682 3.6397 3.9655 6.8994 7.1824 6.9975 9.5169 5.5436 5.8051 1.8697 1.3991 2.2334 6.1717 3.8152 6.2329 7.9103 5.3633 1.4826 1.4743 6.9570 6.1059 7.6235 1.3809 1.3771 1.3132 1.3160 3.5719 2.2726 2.9148 3.8103 1.2560 1.9546 1.6405 1.9994 1.3429 1.5670 1.2057 2.3109 1.9868 1.4854 2.5860 2.8022 2.7417 2.0089 4.0740 2.5379 5.7774 2.9460 4.2402 3.6750 3.0768 1.7968 2.8376 1.0542 1.1206 3.1396 3.2909 3.5833 10.2045 6.3225 6.7108 6.9141 7.3773 9.4896 12.6139 1.0297 1.1053 1.1035 1.0862 1.0860 1.0912 1.0910 1.0965 1.0970 1.0967 1.0958 1.0802 1.0802
irintensity: 9.5671 0.0750 0.8458 0.0242 0.1942 0.3321 1.3682 0.2600 5.0936 0.2394 0.3673 7.9810 0.9326 0.7313 0.0825 2.8739 0.1465 2.9271 11.5928 2.2182 0.1017 18.6890 0.1177 177.0236 7.9348 0.7597 2.4897 2.5352 8.3604 0.1843 0.2362 13.3163 4.8522 0.1968 2.0954 11.2252 0.0413 197.3069 0.4934 4.0547 10.7830 0.0035 23.8136 1.4276 0.0268 0.0004 1.1910 0.2481 7.0494 4.0038 3.3514 0.1921 0.0607 25.8046 24.5225 19.8755 31.9833 0.0294 1.2240 20.3332 8.5406 4.0819 70.0638 2.2782 22.6272 26.7372 3.9350 29.8137 5.3639 63.8761 8.3230 23.8592 240.5486 38.0136 44.0821 42.1580 5.4259 3.4056 20.3664 21.3112 19.1814 53.2821 13.2144 14.2336 14.9102 95.7062 0.9237 8.2577 4.3727 12.9280 93.8734 115.0007 45.0355 23.4912 19.0494 0.8507 0.2423 16.7503 17.5676 53.7686 17.1341 14.1204 10.9451 26.3383 68.5882
temp: 298.150 k
press: 1.00000 atm
elementType: 8 7 7 7 6 6 6 6 6 6 6 6 6 6 6 6 6 6 6 6 6 6 6 6 1 1 1 1 1 1 1 1 1 1 1 1 1
symmnumber: 1
zpe: 731771.0 jmol-1
zpe.correction: 0.278717 hartree
zpe.thermalcorrener: 0.297347 hartree
zpe.thermalcorrenthalpy: 0.298291 hartree
zpe.thermalcorrgfe: 0.231540 hartree
zpe.sumelectzpe: -1007.826666 hartree
zpe.sumelectthermal: -1007.808036 hartree
zpe.sumelectthermalent: -1007.807092 hartree
zpe.sumelectthermalfe: -1007.873842 hartree
dipole: 2.2128 -5.5274 0.0386
dipole: 5.9540
quadrupole: -132.9035 -114.8849 -145.8614
quadrupole: 11.8574 -0.0143 0.0758
quadrupole: -1.6869 16.3317 -14.6448 11.8574 -0.0143 0.0758
hfenergy: -1008.105383 hartree
pointgroup: C01 [X(C20H13N3O1)]
dipole: 0.8408579 -2.17259 0.2449673 debye
polarizability: 457.4504501|-13.6465086|272.8059731|6.0953462|-18.3370836|95.8445845 unknown
InChI: InChI=1S/C20H13N3O/c1-24-20-13(10-21)16-11-6-2-4-8-14(11)22-18(16)19-17(20)12-7-3-5-9-15(12)23-19/h2-9,22-23H,1H3
charge 0 multiplicity 1
37 atoms
O  1.716403 2.42719 -0.345871
N  1.715106 -2.182125 0.120077
N  -1.540833 -2.168651 0.077574
N  -2.089315 3.511282 -0.513061
C  0.799204 -1.12991 0.000703
C  -0.609598 -1.121109 -0.01772
C  1.5229 0.097197 -0.114876
C  -1.305698 0.116883 -0.153232
C  2.94016 -0.236427 -0.063082
C  -2.730471 -0.20361 -0.13909
C  0.841175 1.344242 -0.249141
C  3.02575 -1.664903 0.083749
C  -2.836334 -1.633647 0.006274
C  -0.587068 1.366748 -0.270888
C  4.135301 0.52134 -0.125917
C  -3.922472 0.562064 -0.233383
C  4.256844 -2.344459 0.168242
C  -4.077903 -2.300608 0.058667
C  5.372739 -0.151631 -0.042167
C  -5.165501 -0.098706 -0.181864
C  5.433439 -1.565871 0.103156
C  -5.243973 -1.513202 -0.037409
C  -1.366643 2.560827 -0.404533
C  1.237382 3.812886 -0.476704
H  1.486162 -3.167935 0.216847
H  -1.326898 -3.156363 0.183797
H  4.084649 1.606739 -0.237391
H  -3.882386 1.648623 -0.344177
H  4.308021 -3.433114 0.279776
H  -4.140514 -3.388801 0.1693
H  6.30473 0.421889 -0.08948
H  -6.089124 0.485101 -0.254001
H  6.409089 -2.060556 0.165685
H  -6.225767 -1.998254 -0.000397
H  0.634186 4.112652 0.397062
H  0.652064 3.949415 -1.401705
H  2.157792 4.414107 -0.522022
