program: Gaussian 09
title: 000131447
version: EM64L-G09RevD.01
frameworkgroup: C1[X(C21H15N3O)]
method: RPBEPBE
basis: SDD
operation: Freq
keyword: #p
keyword: freq=noraman
keyword: PBEPBE/SDD
title: #p freq=noraman PBEPBE/SDD
converged: YES YES NO NO
title: Mulliken charges:
elementType: O N N N C C C C C C C C C C C C C C C C C C C C C H H H H H H H H H H H H H H H
charge: -0.266360 -0.232935 -0.478450 -0.050155 0.117639 0.034238 0.102731 0.013554 0.182660 0.229757 0.198354 -0.065819 0.372517 0.194764 -0.671469 -0.386259 -0.376704 -0.333546 -0.382273 -0.252114 -0.232660 -0.287324 -0.213118 -0.356912 -0.514710 0.312539 0.249499 0.237119 0.238218 0.271726 0.223154 0.266582 0.230154 0.224192 0.222986 0.226065 0.223687 0.247197 0.246714 0.234763
chargesum: 0.00000
title: Mulliken charges with hydrogens summed into heavy atoms:
elementType: O N N N C C C C C C C C C C C C C C C C C C C C C
charge: -0.266360 -0.232935 -0.165911 -0.050155 0.117639 0.034238 0.102731 0.013554 0.182660 0.229757 0.198354 -0.065819 0.372517 0.194764 0.053367 -0.114533 -0.153550 -0.066965 -0.152120 -0.027922 -0.009674 -0.061259 0.010568 -0.356912 0.213964
polarizability: 4.68891344e+02 6.74358470e+00 2.92054077e+02 -5.99987983e-02 -1.27479205e-01 1.02247955e+02
1716.lowfreq: -6.1168 -3.5779 -2.6209 -0.0008 -0.0004 0.0006 13.8337 40.1214 62.0163
frequency: 13.7260 40.1180 62.0155 80.4741 106.2303 109.0730 120.0984 128.0467 132.6899 154.3942 197.9775 225.1866 247.5711 251.7889 264.9000 274.1539 291.2034 316.2879 341.8640 351.2151 363.7777 387.8264 432.3362 435.3140 442.4368 458.6044 490.1745 526.0265 535.5147 542.5977 566.3050 569.4983 572.6528 622.4273 637.5219 656.9020 658.2453 679.9365 746.6931 753.3580 755.4555 758.1991 771.5641 776.0501 816.7156 825.3479 856.3126 857.4549 860.5591 879.9278 917.0276 941.8165 944.2476 981.8208 983.3377 996.9865 1019.0217 1020.5263 1050.5125 1091.1654 1105.3600 1108.8375 1117.9485 1125.7353 1129.8662 1162.9484 1167.8961 1176.8262 1197.0803 1221.1870 1246.4278 1268.2965 1274.4183 1317.7621 1329.9809 1348.5098 1370.6996 1392.3122 1405.8981 1413.6118 1422.7050 1429.6612 1443.3348 1454.7739 1464.7548 1467.1259 1467.7413 1475.8868 1478.9723 1483.0364 1484.6320 1498.5796 1568.6556 1583.7806 1587.1599 1619.8284 1628.0224 1646.8772 2149.8494 2967.8306 2995.1537 3042.4247 3101.3072 3116.1908 3126.3371 3126.6809 3127.9879 3141.4623 3142.1974 3159.2672 3159.7228 3181.1531 3188.0143 3632.1807
redmass: 3.5198 3.8953 3.6702 2.3785 2.1217 2.5252 5.1549 3.6799 6.9622 5.2219 5.3612 2.0149 1.6606 3.7395 5.2037 4.2004 4.7998 5.7572 5.8429 6.0051 6.2138 7.7177 6.1331 2.5886 1.2706 3.1642 8.5249 9.4776 6.1460 6.0406 3.7626 5.8003 4.0787 7.1727 6.6801 5.9247 10.0392 5.7298 1.7581 5.2554 1.3951 2.3779 3.9573 6.9878 5.8611 6.7279 5.3747 1.4866 1.5172 7.2114 5.4681 1.3778 1.3771 1.3137 1.3161 8.2087 2.1238 2.1370 6.0592 2.8983 1.2561 2.2407 1.2950 1.8219 1.5166 1.4013 1.1730 1.2056 2.2304 3.0508 1.7115 2.0603 3.3366 3.8591 2.3973 2.5527 3.3010 4.6365 4.7097 2.8244 2.9015 3.5527 1.7525 1.7388 2.2962 1.0499 1.1625 2.8272 1.0456 2.8829 3.1510 1.2887 10.3218 6.3972 6.9278 7.4196 7.1901 9.8158 12.6116 1.0378 1.0297 1.1025 1.1053 1.0947 1.1036 1.0862 1.0854 1.0910 1.0909 1.0965 1.0971 1.0964 1.0957 1.0799
irintensity: 9.4635 0.0108 1.0199 0.0822 0.2914 0.5954 0.2109 2.5921 1.3291 0.1380 5.1609 0.7879 0.5192 0.7100 4.0761 1.7332 0.6373 1.5476 2.0839 0.0585 1.1193 0.5096 0.4973 44.2588 45.7258 7.3754 8.6380 0.0312 3.3903 2.3731 3.6547 2.6628 0.0280 9.2322 9.8279 0.1947 0.0515 8.2090 2.2143 2.5103 193.4530 0.2374 4.5716 4.8614 0.0045 25.6898 3.0107 0.4040 0.0559 0.5954 1.9973 2.9742 2.9839 0.3860 0.0651 40.3256 30.9730 2.4840 0.2073 29.7575 0.0452 18.7906 0.4067 35.7570 0.7082 11.4562 15.6974 14.0383 56.1521 44.1573 5.4535 0.3879 46.3966 96.7831 26.9095 34.1657 179.9377 31.5673 8.1371 57.7745 26.8941 1.9368 5.4399 18.6793 30.5697 16.3507 48.8789 11.0031 14.6934 27.4772 23.3732 30.6472 100.4812 2.7095 16.4005 12.4256 12.9647 88.3028 125.5391 61.2725 45.7691 25.8121 23.5235 9.4632 19.1866 0.8987 0.4285 16.4087 20.3959 40.4018 32.2791 13.7104 11.0686 43.9427
temp: 298.150 k
press: 1.00000 atm
elementType: 8 7 7 7 6 6 6 6 6 6 6 6 6 6 6 6 6 6 6 6 6 6 6 6 6 1 1 1 1 1 1 1 1 1 1 1 1 1 1 1
symmnumber: 1
zpe: 803508.3 jmol-1
zpe.correction: 0.306040 hartree
zpe.thermalcorrener: 0.326392 hartree
zpe.thermalcorrenthalpy: 0.327337 hartree
zpe.thermalcorrgfe: 0.256592 hartree
zpe.sumelectzpe: -1047.044229 hartree
zpe.sumelectthermal: -1047.023876 hartree
zpe.sumelectthermalent: -1047.022932 hartree
zpe.sumelectthermalfe: -1047.093676 hartree
dipole: -2.5552 -5.8501 0.0302
dipole: 6.3839
quadrupole: -141.4967 -120.8769 -151.8290
quadrupole: -11.0029 0.0250 0.1175
quadrupole: -3.4291 17.1906 -13.7615 -11.0029 0.0250 0.1175
hfenergy: -1047.3502688 hartree
pointgroup: C01[X(C21H15N3O1)]
dipole: 0.9470495 -2.318973 0.1833114 debye
polarizability: 468.3870267|-10.8098108|291.3183777|5.2458232|-14.9834362|103.4879718 unknown
InChI: InChI=1S/C21H15N3O/c1-24-16-10-6-4-8-13(16)18-20(24)19-17(14(11-22)21(18)25-2)12-7-3-5-9-15(12)23-19/h3-10,23H,1-2H3
charge 0 multiplicity 1
40 atoms
O  1.587793 2.617681 -0.314379
N  1.709323 -2.009262 0.054177
N  -1.556477 -2.067076 0.016389
N  -2.242206 3.609734 -0.431695
C  0.76791 -0.972333 -0.039996
C  -0.644008 -0.998597 -0.056087
C  1.453968 0.279169 -0.131583
C  -1.370824 0.226389 -0.162263
C  2.877907 -0.013939 -0.092319
C  3.004552 -1.442857 0.022614
C  -2.787777 -0.12515 -0.15314
C  0.741105 1.51052 -0.237595
C  -0.686542 1.497426 -0.253198
C  -2.861775 -1.55964 -0.040932
C  1.400747 -3.434057 0.165475
C  4.046486 0.784518 -0.142464
C  4.262008 -2.078123 0.086169
C  -3.996887 0.616055 -0.227655
C  -4.088534 -2.255285 -0.002371
C  5.306517 0.153651 -0.078694
C  5.412114 -1.260298 0.034187
C  -5.224746 -0.07305 -0.189772
C  -5.27177 -1.492187 -0.078332
C  -1.496521 2.674142 -0.352482
C  1.073541 3.990933 -0.441002
H  -1.318712 -3.05121 0.094494
H  2.337259 -4.005521 0.245845
H  0.803639 -3.645294 1.073053
H  0.861219 -3.801272 -0.728621
H  3.957314 1.869675 -0.228693
H  4.363161 -3.165241 0.171553
H  -3.981446 1.705455 -0.312945
H  -4.126588 -3.346917 0.083124
H  6.218773 0.758665 -0.116418
H  6.402823 -1.726001 0.081489
H  -6.161193 0.491744 -0.246828
H  -6.24262 -1.999476 -0.051198
H  0.466273 4.27443 0.435234
H  0.481469 4.114121 -1.363702
H  1.978422 4.615177 -0.48884
