program: Gaussian 09
title: 000131442
version: EM64L-G09RevD.01
frameworkgroup: C1[X(C18H20F5NO3)]
method: RPBEPBE
basis: SDD
operation: Freq
keyword: #p
keyword: freq=noraman
keyword: PBEPBE/SDD
title: #p freq=noraman PBEPBE/SDD
converged: YES YES NO NO
title: Mulliken charges:
elementType: F F F F F O O O N C C C C C C C C C C C C C C C C C C H H H H H H H H H H H H H H H H H H H H
charge: -0.167091 -0.163745 -0.156839 -0.144394 -0.129160 -0.260502 -0.463406 -0.314220 -0.135794 -0.333882 -0.086937 0.344158 0.284654 -0.416911 0.122777 -0.411047 -0.742131 -0.745308 0.249793 -0.429442 -0.506220 -0.497488 -0.366029 0.304152 -0.329627 0.100103 0.379213 0.304217 0.221414 0.238150 0.252970 0.215239 0.248074 0.254130 0.221663 0.224370 0.255428 0.231046 0.230927 0.228681 0.224796 0.219618 0.260332 0.276877 0.378086 0.264490 0.264816
chargesum: 0.00000
title: Mulliken charges with hydrogens summed into heavy atoms:
elementType: F F F F F O O O N C C C C C C C C C C C C C C C C C C
charge: -0.167091 -0.163745 -0.156839 -0.144394 -0.129160 -0.260502 -0.085321 -0.314220 -0.135794 -0.029666 0.134477 0.344158 0.284654 0.074209 0.122777 0.052266 -0.041967 -0.027906 0.249793 0.024035 -0.026270 -0.220611 -0.101539 0.304152 -0.064812 0.100103 0.379213
polarizability: 2.58289433e+02 3.66954161e+00 2.25041010e+02 -1.20120329e+00 1.40099028e+01 1.51431330e+02
1716.lowfreq: -8.6008 -6.1226 -0.0009 -0.0007 -0.0003 2.2534 17.8012 25.2666 45.5497
frequency: 17.4991 25.2384 45.5062 49.8568 53.7657 55.2707 84.3955 89.6374 101.9148 125.5217 153.3725 174.2103 180.2523 182.2577 200.0513 207.6049 219.9606 223.4250 233.8494 243.5498 273.3089 280.0977 294.1016 315.2737 330.7715 336.1769 341.2088 359.3815 399.6562 407.7930 432.5758 435.2925 455.4195 458.4096 477.7447 492.6606 501.5139 520.9273 528.1654 536.0394 564.5101 592.6586 602.2119 622.9421 640.1970 651.7960 682.6714 706.4335 721.9815 730.7747 772.1099 791.4086 810.6190 833.8535 843.0301 865.9278 874.7836 895.6342 920.1881 930.7134 936.6554 955.1403 965.5814 968.4225 971.2267 991.4790 999.0455 1012.3344 1026.6748 1040.7711 1050.0489 1064.4762 1079.3614 1094.3181 1105.6487 1118.6465 1138.3942 1154.9956 1165.6601 1168.5910 1178.0658 1185.7575 1210.8950 1232.6558 1241.8395 1250.1877 1254.9650 1256.9228 1272.3625 1294.1783 1301.6597 1319.0257 1327.1215 1329.1437 1340.0683 1349.2874 1363.7159 1375.3613 1388.4245 1390.9069 1410.5295 1425.2256 1432.0278 1448.6310 1456.9484 1463.9738 1473.8553 1476.7480 1484.5099 1487.0604 1488.7505 1494.7524 1562.9491 1578.7889 1622.6207 2947.7315 2975.5320 2981.9570 2982.5981 2995.5707 2998.3742 3002.5878 3013.6013 3055.5304 3073.7055 3083.1138 3087.2612 3090.3853 3096.1263 3106.0967 3113.7083 3149.4608 3159.6848 3180.2048 3230.4338
redmass: 8.0296 8.6798 5.1953 6.4956 6.2783 4.1371 4.7874 3.7640 4.6533 3.8442 3.9609 2.7949 1.1591 3.6112 3.7995 6.6731 1.9216 4.1709 2.4094 5.7362 5.5370 3.6086 5.2668 15.5821 3.3333 5.2474 3.9758 6.0909 6.2211 5.5608 3.5873 4.2572 7.0411 7.4777 5.4076 4.0335 3.3574 4.3567 6.6846 7.6219 3.6410 3.2892 4.4274 2.0779 3.1690 4.2178 5.1113 3.2142 3.6469 3.7440 1.8128 2.7027 3.9335 1.7700 2.9034 2.5943 3.5640 3.3962 1.8270 1.9603 1.4424 2.7119 1.4558 2.1292 2.1324 7.0622 1.5684 3.4602 4.7134 12.2254 2.6333 11.5114 2.4231 3.5275 2.1166 2.1769 1.9508 1.6884 1.9543 2.0742 1.5238 3.4049 2.9591 1.4140 2.1408 1.2388 2.5666 1.4148 2.2338 2.1792 1.3679 1.3963 1.3014 1.3886 1.4069 1.4396 1.3906 1.2520 2.8578 1.5740 2.4282 4.6073 1.3745 1.0868 1.0530 1.0485 1.0770 1.0807 2.3976 1.1481 1.0981 1.1460 6.4834 7.6820 6.8294 1.0832 1.0695 1.0818 1.0681 1.0354 1.0362 1.0596 1.0649 1.0994 1.0980 1.0968 1.0979 1.0995 1.0997 1.1001 1.0994 1.0916 1.0884 1.0974 1.0710
irintensity: 0.6903 0.6847 1.0005 2.1248 0.3107 1.3470 1.8741 2.0437 0.8798 0.9430 4.1816 2.1771 0.3633 1.7169 9.8081 1.9795 1.7046 2.8481 2.1313 2.1103 4.0084 6.1494 1.2666 0.1146 5.2782 2.2279 3.1908 3.1266 6.5822 2.9331 8.9338 0.2879 3.0147 6.6197 5.2432 3.1611 5.6942 7.2357 0.8087 0.9249 17.1539 20.3690 0.4984 38.7146 60.1507 35.7651 22.7827 31.9648 7.3827 3.0192 15.7054 6.0260 7.8326 68.6081 37.4519 8.5250 14.1976 47.0366 35.3629 13.7168 2.4729 32.4972 6.2234 19.1685 13.1321 23.0006 22.0834 54.8947 128.3281 292.2955 13.6551 175.0921 4.1937 0.6035 4.7440 192.1876 23.1189 31.7863 12.7090 92.3562 30.4805 93.6109 41.8070 53.1278 56.2665 6.0678 43.7528 0.6774 43.0201 90.1084 13.7701 25.3333 9.9870 2.4039 1.5316 20.5257 10.0659 32.0196 8.9006 38.4808 79.6358 2.5373 139.5390 10.4042 7.2752 1.1554 6.4974 8.7485 63.2226 18.1268 14.6687 16.0588 196.2003 46.3371 102.1918 29.0330 27.9556 12.3628 14.1604 17.5301 11.9641 30.5279 35.4064 13.7781 23.0246 29.5288 16.6267 20.7101 34.5502 6.9399 12.7183 0.7656 0.9395 2.0700 318.2697
temp: 298.150 k
press: 1.00000 atm
elementType: 9 9 9 9 9 8 8 8 7 6 6 6 6 6 6 6 6 6 6 6 6 6 6 6 6 6 6 1 1 1 1 1 1 1 1 1 1 1 1 1 1 1 1 1 1 1 1
symmnumber: 1
zpe: 935474.7 jmol-1
zpe.correction: 0.356303 hartree
zpe.thermalcorrener: 0.381946 hartree
zpe.thermalcorrenthalpy: 0.382890 hartree
zpe.thermalcorrgfe: 0.299992 hartree
zpe.sumelectzpe: -1475.540177 hartree
zpe.sumelectthermal: -1475.514534 hartree
zpe.sumelectthermalent: -1475.513590 hartree
zpe.sumelectthermalfe: -1475.596488 hartree
dipole: -0.5714 0.6370 -2.5985
dipole: 2.7358
quadrupole: -186.1644 -142.4714 -160.4329
quadrupole: 4.4704 1.5032 -6.4763
quadrupole: -23.1415 20.5515 2.5900 4.4704 1.5032 -6.4763
hfenergy: -1475.89648 hartree
pointgroup: C01 [X(C18H20F5N1O3)]
dipole: 0.2699451 -0.2340342 -1.0153174 debye
polarizability: 258.105635|3.2856499|225.4485736|6.3845606|-12.2123879|151.2075645 unknown
InChI: InChI=1S/C18H20F5NO3/c1-16(2)15(26)14(24-8-4-3-5-13(24)25)11-9-10(6-7-12(11)27-16)17(19,20)18(21,22)23/h6-7,9,14-15,26H,3-5,8H2,1-2H3
charge 0 multiplicity 1
47 atoms
F  -3.192829 -0.325562 1.54339
F  -4.043126 1.736282 0.97133
F  -3.279291 -1.098896 -1.184085
F  -4.144373 0.92931 -1.737095
F  -5.263165 -0.432697 -0.311849
O  2.031578 2.589535 -0.681337
O  4.273321 -0.276722 0.264978
O  2.980078 -2.443934 1.451382
N  1.528257 -1.576385 -0.156395
C  1.792413 -0.187509 0.329177
C  3.096318 0.383124 -0.286919
C  3.235916 1.913315 -0.040984
C  0.59623 0.73193 0.107395
C  0.885994 -1.845746 -1.469527
C  0.782368 2.055259 -0.388057
C  -0.175485 -2.977582 -1.374225
C  4.435687 2.473962 -0.805312
C  3.266766 2.283754 1.451579
C  2.140731 -2.630877 0.499664
C  0.217973 -4.056962 -0.322251
C  1.730624 -4.011997 0.011664
C  -0.713484 0.305327 0.410789
C  -0.333513 2.899563 -0.621889
C  -1.823933 1.149596 0.194367
C  -1.631129 2.451453 -0.338128
C  -3.208345 0.666666 0.509181
C  -3.991651 0.012687 -0.682589
H  1.971723 -0.30247 1.418816
H  3.074553 0.2255 -1.387537
H  1.668505 -2.127399 -2.202157
H  0.422349 -0.912703 -1.827337
H  -0.274659 -3.431017 -2.37789
H  -1.159639 -2.548142 -1.119398
H  5.353401 1.973945 -0.454436
H  4.326726 2.289632 -1.888329
H  4.52596 3.561632 -0.642486
H  4.116284 1.770723 1.933071
H  3.394161 3.373238 1.567382
H  2.339543 1.989104 1.974175
H  -0.055577 -5.065041 -0.681325
H  -0.347076 -3.89159 0.613676
H  2.328673 -4.265568 -0.887894
H  2.005519 -4.736857 0.795289
H  -0.862812 -0.699918 0.818911
H  3.985472 -1.034793 0.863543
H  -0.151862 3.90508 -1.01133
H  -2.488175 3.110149 -0.506498
