program: Gaussian 09
title: 000131437
version: EM64L-G09RevD.01
frameworkgroup: C1[X(C23H20N2O)]
method: RPBEPBE
basis: SDD
operation: Freq
keyword: #p
keyword: freq=noraman
keyword: PBEPBE/SDD
title: #p freq=noraman PBEPBE/SDD
converged: YES YES NO NO
title: Mulliken charges:
elementType: O N N C C C C C C C C C C C C C C C C C C C C C C C H H H H H H H H H H H H H H H H H H H H
charge: -0.479036 -0.176450 -0.189357 -0.441152 -0.182027 0.318633 0.143995 -0.530227 0.419331 0.309608 0.327843 -0.412372 -0.398914 -0.360361 -0.391083 -0.367972 -0.360735 -0.232391 -0.220681 -0.245293 -0.232164 -0.241798 -0.233498 -0.248277 -0.235707 -0.239290 0.256226 0.259940 0.208408 0.263222 0.228638 0.289066 0.250293 0.248507 0.363723 0.221773 0.251856 0.223564 0.224281 0.233308 0.231532 0.226159 0.234990 0.225661 0.228617 0.229610
chargesum: 0.00000
title: Mulliken charges with hydrogens summed into heavy atoms:
elementType: O N N C C C C C C C C C C C C C C C C C C C C C C C
charge: -0.115313 -0.176450 -0.189357 0.075014 0.026380 0.318633 0.143995 -0.267005 0.419331 0.309608 0.327843 -0.183734 -0.109848 -0.110067 -0.142575 -0.146199 -0.108880 -0.008827 0.003600 -0.011984 -0.000632 -0.015639 0.001492 -0.022616 -0.007090 -0.009680
polarizability: 3.69477929e+02 -4.38259574e+01 3.07085158e+02 2.45605346e+01 3.57769911e+01 1.51164565e+02
1716.lowfreq: -4.3231 -0.0006 -0.0005 0.0004 2.1439 5.8804 15.0403 25.0043 29.8129
frequency: 14.8753 24.9630 29.7908 33.9146 47.7831 48.7778 60.4711 94.4142 102.4453 129.9141 153.3962 208.0311 217.2171 234.2413 253.8389 268.3797 275.9855 364.0734 376.2183 392.0631 400.1785 404.2122 406.2492 419.6767 476.0198 482.6483 504.2369 523.3698 568.9813 606.0442 613.7700 616.2209 616.9340 661.9368 663.4173 680.5138 685.6690 698.0609 704.3656 706.2526 743.2960 753.8733 765.1089 773.6812 779.2983 823.3987 845.5198 851.4797 854.7911 859.1941 884.8555 926.4221 927.2079 928.4390 951.3076 979.1125 979.4981 981.8511 984.3655 989.3240 989.5292 991.1758 998.2959 999.5988 1001.5161 1020.9501 1025.7707 1028.5080 1031.1723 1036.0561 1069.8415 1081.8713 1082.9954 1096.5870 1148.8707 1170.5220 1173.2413 1175.1916 1179.6251 1190.0312 1193.0026 1198.8380 1204.5136 1224.3304 1245.9943 1260.6110 1301.6152 1305.8626 1315.6119 1326.1891 1341.5796 1350.6936 1370.3429 1380.2648 1386.3238 1401.2438 1428.5972 1435.9823 1438.1366 1445.7692 1448.5115 1453.0397 1470.6761 1485.3616 1518.5417 1550.1985 1583.8367 1588.9461 1594.5210 1615.2013 1616.9399 1619.7500 2926.9574 3006.0005 3095.4384 3105.5031 3124.6389 3125.1807 3128.7090 3133.4778 3133.6451 3138.6319 3145.3540 3145.9775 3154.2397 3157.0227 3157.4182 3169.0316 3169.1420 3174.5857 3185.3488 3236.9354
redmass: 3.7018 4.3307 5.2664 4.6396 4.3228 5.5012 4.9893 4.6919 4.6617 5.1628 4.6934 4.9260 5.1719 5.6250 4.6010 3.8732 4.4093 4.5880 5.1417 5.1214 2.7981 2.8790 2.8568 6.4993 3.2753 4.3372 3.8236 3.0821 3.3273 5.5360 6.3938 6.4137 6.3663 6.2205 6.5212 3.9215 2.4675 2.2058 1.8745 1.9372 1.7710 1.3760 1.9042 2.0657 1.8908 1.7366 3.3949 1.2609 1.2773 1.2491 2.6434 1.4570 1.4269 1.4403 7.7550 1.4122 1.5288 1.3625 4.5785 5.8978 6.0178 6.2450 1.3273 1.3212 1.3619 2.6738 2.2771 2.2502 4.1016 2.0153 1.6805 1.6368 1.6332 1.9558 2.7579 1.0621 1.0604 1.0552 1.1324 1.1911 1.1160 2.0096 2.3069 1.3582 3.3271 1.4650 1.6132 1.4645 1.3325 1.2619 1.3223 2.3126 4.4762 7.4997 7.6509 4.9363 2.7995 2.0067 2.1838 1.7371 1.1909 2.1982 2.3320 2.3563 4.1169 5.9464 6.0285 6.2116 6.2712 6.1402 6.2084 6.1177 1.0830 1.0630 1.0997 1.0880 1.0865 1.0846 1.0849 1.0878 1.0878 1.0928 1.0924 1.0931 1.0968 1.0984 1.0960 1.1017 1.1006 1.0958 1.0666 1.0982
irintensity: 0.0700 0.3651 0.8098 0.6270 0.2167 0.2176 0.2807 0.8443 0.3200 0.8938 3.4706 0.2991 1.6801 0.5716 2.4225 1.6952 8.0034 2.2439 1.0322 1.6845 0.0220 0.0960 0.0424 2.8742 3.1598 1.4538 7.1248 27.0164 12.4713 2.1645 0.3995 0.0453 0.1367 11.6214 9.5693 6.7959 9.0755 20.5948 51.9239 37.0394 79.8496 20.9610 156.7548 58.2896 24.8244 17.2511 2.2973 0.1802 1.5906 0.5681 19.3000 3.0171 7.7268 1.7001 7.1391 0.2460 0.0375 0.2865 6.8216 0.3204 0.1407 3.9690 0.3940 0.0920 1.2101 34.5505 5.7605 5.8892 9.6505 2.2482 8.7716 10.0953 20.0041 11.9589 1.7817 1.0185 0.1190 0.0473 4.0249 8.5651 0.9477 18.4832 12.6861 11.6555 0.1452 50.2331 13.7246 2.9774 2.6961 14.3697 0.1375 6.4372 0.1691 0.5883 0.9378 2.1736 46.3330 21.1980 7.2367 100.6685 20.2095 87.3960 80.7051 11.5908 2.8572 14.3166 1.1067 1.0337 0.4209 5.8162 7.3602 4.6292 33.8128 23.4535 6.8258 13.2086 1.0896 4.5449 3.8030 2.0550 0.1675 32.6241 16.5205 29.9417 28.4032 46.7932 29.1119 28.8421 14.5258 22.7503 584.3700 0.2345
temp: 298.150 k
press: 1.00000 atm
elementType: 8 7 7 6 6 6 6 6 6 6 6 6 6 6 6 6 6 6 6 6 6 6 6 6 6 6 1 1 1 1 1 1 1 1 1 1 1 1 1 1 1 1 1 1 1 1
symmnumber: 1
zpe: 966326.6 jmol-1
zpe.correction: 0.368054 hartree
zpe.thermalcorrener: 0.389489 hartree
zpe.thermalcorrenthalpy: 0.390433 hartree
zpe.thermalcorrgfe: 0.313830 hartree
zpe.sumelectzpe: -1071.369888 hartree
zpe.sumelectthermal: -1071.348454 hartree
zpe.sumelectthermalent: -1071.347509 hartree
zpe.sumelectthermalfe: -1071.424113 hartree
dipole: -0.2085 4.4534 0.1230
dipole: 4.4600
quadrupole: -133.4005 -142.3639 -152.8456
quadrupole: -6.4781 5.6283 7.8568
quadrupole: 9.4694 0.5061 -9.9756 -6.4781 5.6283 7.8568
hfenergy: -1071.7379428 hartree
pointgroup: C01 [X(C23H20N2O1)]
dipole: 0.185843 -1.7445241 0.0325944 debye
polarizability: 371.2336903|-41.7730423|302.4481555|-34.599947|-34.4243993|154.0458075 unknown
InChI: InChI=1S/C23H20N2O/c26-23(20-14-8-3-9-15-20)17-25-22(19-12-6-2-7-13-19)16-21(24-25)18-10-4-1-5-11-18/h1-16,23,26H,17H2
charge 0 multiplicity 1
46 atoms
O  0.584815 2.687861 -0.1331
N  -0.136507 -0.21861 -0.3698
N  -1.204491 0.669332 -0.274705
C  1.218791 0.336924 -0.570576
C  1.45936 1.606984 0.302017
C  -0.539915 -1.533738 -0.142801
C  -2.304282 -0.101786 0.016493
C  -1.924465 -1.47601 0.111522
C  2.913355 2.049905 0.173874
C  0.347996 -2.712034 -0.186309
C  -3.637194 0.508092 0.183513
C  3.939233 1.321106 0.827006
C  3.255989 3.17207 -0.616821
C  1.334449 -2.881237 -1.197736
C  0.187823 -3.736818 0.787056
C  -4.738806 -0.269843 0.631941
C  -3.846243 1.886549 -0.097029
C  5.291734 1.701984 0.683841
C  4.609551 3.554747 -0.758934
C  2.145291 -4.036188 -1.223778
C  0.994356 -4.893412 0.754862
C  5.63141 2.820574 -0.113559
C  1.981063 -5.045895 -0.24748
C  -6.01338 0.312677 0.794485
C  -5.119451 2.468169 0.068635
C  -6.210691 1.684924 0.514607
H  1.353423 0.619154 -1.632121
H  1.94686 -0.448731 -0.314135
H  1.245643 1.332227 1.360258
H  -2.569579 -2.334225 0.281358
H  3.682909 0.462105 1.461682
H  2.448039 3.737967 -1.088989
H  1.442493 -2.12894 -1.986999
H  -0.560558 -3.610902 1.577387
H  -0.334435 2.271201 -0.199932
H  -4.59946 -1.331904 0.862606
H  -3.005685 2.492117 -0.450231
H  6.076564 1.134683 1.197076
H  4.866307 4.428962 -1.36829
H  2.896146 -4.15214 -2.012912
H  0.859664 -5.670713 1.514995
H  6.680001 3.12029 -0.222569
H  2.610427 -5.942141 -0.270139
H  -6.851254 -0.302074 1.141955
H  -5.262491 3.531798 -0.152097
H  -7.200306 2.137439 0.641876
