program: Gaussian 09
title: 000131430
version: EM64L-G09RevD.01
frameworkgroup: C1[X(C16H28N6O6)]
method: RPBEPBE
basis: SDD
operation: Freq
keyword: #p
keyword: freq=noraman
keyword: PBEPBE/SDD
title: #p freq=noraman PBEPBE/SDD
converged: YES YES NO NO
title: Mulliken charges:
elementType: O O O O O O N N N N N N C C C C C C C C C C C C C C C C H H H H H H H H H H H H H H H H H H H H H H H H H H H H
charge: -0.284088 -0.414929 -0.227817 -0.328701 -0.412342 -0.251453 -0.152479 -0.404276 -0.720904 -0.266761 -0.654304 -0.691270 -0.135287 -0.474480 -0.371132 -0.477199 -0.164365 0.224381 -0.470927 0.175681 -0.405496 0.178401 -0.165583 -0.438247 -0.407029 -0.517783 0.191599 0.314556 0.314628 0.242446 0.242428 0.274176 0.222393 0.229539 0.234060 0.251595 0.223526 0.247043 0.446732 0.193667 0.210710 0.285750 0.197715 0.212899 0.193310 0.230939 0.375052 0.250046 0.309981 0.291315 0.308571 0.372783 0.309422 0.337223 0.284410 0.459873
chargesum: 0.00000
title: Mulliken charges with hydrogens summed into heavy atoms:
elementType: O O O O O O N N N N N N C C C C C C C C C C C C C C C C
charge: -0.284088 -0.039877 -0.227817 -0.328701 -0.039558 -0.251453 -0.152479 0.042456 -0.121018 -0.266761 -0.007659 0.053013 0.179341 0.010395 0.125437 -0.013600 0.087230 0.224381 -0.000357 0.175681 -0.001120 0.178401 0.120167 -0.027632 0.017220 0.042244 0.191599 0.314556
polarizability: 2.74361518e+02 1.15571971e+01 2.39743369e+02 9.80070219e+00 7.06199161e+00 1.95422645e+02
1716.lowfreq: -7.5617 -5.8048 -3.7472 -0.0010 -0.0004 -0.0002 5.1727 15.3580 22.7317
frequency: 3.3280 15.3353 22.6326 27.8980 32.0887 40.3696 43.5670 55.3416 61.1767 70.3195 82.3255 92.8945 105.8328 122.6970 126.7689 137.4414 149.9769 168.4536 171.7059 185.5272 208.6779 220.7284 238.3513 258.1119 270.6891 284.2197 293.3663 298.2389 320.6144 329.3973 332.7012 349.6460 359.7287 381.7457 407.9175 413.9454 419.7265 453.9623 458.5821 477.2442 500.5264 513.4257 532.4540 538.8250 557.7282 561.3405 577.2097 586.4606 614.5306 625.4124 639.0567 672.9961 695.8220 699.0381 715.0207 744.2345 771.9894 786.2167 798.6933 812.0800 843.1213 857.9187 865.1890 872.0401 892.9749 909.3816 914.8247 919.2252 947.7651 974.8394 982.2295 990.5606 1011.0997 1023.2229 1034.9758 1040.0992 1042.3555 1044.9324 1059.1879 1073.9213 1074.7239 1078.2211 1097.9399 1103.7284 1114.7717 1121.3934 1132.3197 1150.5070 1162.4637 1166.0273 1175.8926 1178.5174 1185.9208 1205.5258 1229.9030 1237.0869 1240.4248 1247.2990 1251.9827 1257.8557 1258.7159 1282.3754 1299.8615 1303.2977 1320.9335 1324.8911 1325.7524 1329.6254 1341.7647 1344.3963 1353.1494 1353.9682 1359.1387 1366.7128 1378.8636 1388.6719 1436.3821 1443.6719 1457.2249 1460.5630 1462.7452 1468.1036 1471.1633 1473.3647 1493.1350 1559.4493 1582.4141 1591.1239 1618.2514 1631.0285 1658.2024 1667.4718 1680.2528 1707.0899 2313.5947 2850.8314 2882.4170 2930.2509 2983.5338 2987.2203 2989.2403 2992.7134 2994.6233 2995.7677 3006.4325 3016.1827 3023.6297 3040.0274 3052.4039 3053.5819 3058.2573 3060.4170 3065.9963 3084.2849 3100.5386 3412.0291 3512.4340 3513.4701 3533.4348 3558.8304 3601.9283 3703.5241
redmass: 4.9813 7.0865 5.7056 5.0225 6.4024 9.5042 8.5388 4.1369 5.9783 6.3773 4.0883 5.1793 3.7417 4.4219 4.7709 3.7268 3.0849 3.2844 4.2745 3.8848 2.7470 3.3219 3.5651 2.4352 3.4451 3.5655 2.7476 2.5616 2.1835 3.7568 3.2660 4.2285 1.2809 5.3262 1.1712 5.0944 2.9179 1.6750 1.3985 3.1979 2.1544 3.6561 2.4868 2.4762 2.8682 3.2680 3.1317 2.1653 4.4611 1.8984 1.4400 6.3556 4.6071 5.7688 4.5221 2.5955 2.5022 2.5988 2.2915 3.3882 3.1619 2.1677 2.5993 2.1727 2.1691 1.8376 2.0033 2.5211 3.4803 2.5764 2.0888 2.1398 2.4779 2.5035 2.0207 2.6219 2.0657 1.7571 1.8132 2.2592 2.2090 2.0680 1.8641 1.8127 2.1635 2.2507 1.1685 1.5384 1.4712 1.1910 1.3524 1.3093 2.4333 1.7029 1.2409 1.3004 1.3786 1.5756 1.3424 1.4868 1.5593 1.3554 1.3231 2.1018 1.3247 1.3454 1.2625 1.4444 1.4179 1.3804 1.9972 1.4474 1.5608 1.4519 1.9334 3.6342 1.0980 1.0871 1.0884 1.2629 2.7409 1.0858 1.1097 1.0928 1.0969 6.9124 5.6688 2.6064 1.2004 1.1072 7.5163 8.5099 1.2707 1.4625 1.1418 1.0854 1.0586 1.0984 1.0617 1.0735 1.0629 1.0624 1.0807 1.0696 1.0627 1.0638 1.0632 1.1008 1.1016 1.1044 1.0967 1.0849 1.0999 1.1026 1.1052 1.0460 1.0639 1.0641 1.0956 1.0451 1.0806 1.1040
irintensity: 0.2518 0.1298 1.3127 0.3078 2.2669 0.9681 0.7918 5.0866 2.1965 0.1128 2.8220 3.0817 5.6926 4.9972 9.5468 6.2891 0.9335 1.2380 2.1770 6.2583 7.1578 4.0528 16.9177 2.1331 7.1015 1.7131 5.2619 6.0105 11.9135 28.8057 2.6220 43.6392 81.1940 2.1107 247.6277 25.0967 29.6101 60.2635 41.2183 12.0203 24.4060 34.7131 27.3324 46.2584 16.2508 8.0668 15.4599 33.4976 12.7415 80.9056 134.3612 5.6196 17.4740 14.5011 10.2533 20.1048 7.3668 4.0183 25.1599 5.8526 31.0777 54.4392 55.6457 30.2150 16.1692 36.2550 4.3729 9.9996 17.9375 7.5741 28.1459 8.4625 3.9201 14.5252 108.6415 336.1246 216.3395 26.0854 20.3292 25.2863 51.7593 17.3150 6.0972 24.3096 6.9979 8.4208 95.0834 7.0860 2.7069 33.7286 17.2238 7.6419 10.8567 16.2447 11.2044 3.6933 5.1671 39.6712 6.0341 6.4772 8.9579 30.4374 2.3545 90.3393 3.8599 17.9666 6.6939 15.6562 12.0906 3.8430 44.9017 71.3832 18.6554 31.6468 13.5462 176.0795 20.3476 48.8449 21.8058 41.5122 125.1100 8.1134 19.0345 12.1594 0.5057 308.8314 104.2030 405.4485 249.5320 76.4823 150.2018 159.7431 143.5024 351.0850 2040.6033 1538.7769 27.6291 43.9144 46.1591 6.4570 32.8970 22.9435 9.7377 44.1770 25.3340 35.7834 19.3973 53.3708 23.5846 24.0535 8.8391 6.6403 10.4145 26.0694 29.5647 1.8048 20.3052 21.7659 4.1984 26.8006 27.0313 21.3479
temp: 298.150 k
press: 1.00000 atm
elementType: 8 8 8 8 8 8 7 7 7 7 7 7 6 6 6 6 6 6 6 6 6 6 6 6 6 6 6 6 1 1 1 1 1 1 1 1 1 1 1 1 1 1 1 1 1 1 1 1 1 1 1 1 1 1 1 1
symmnumber: 1
zpe: 1200213.7 jmol-1
zpe.correction: 0.457137 hartree
zpe.thermalcorrener: 0.487334 hartree
zpe.thermalcorrenthalpy: 0.488278 hartree
zpe.thermalcorrgfe: 0.390351 hartree
zpe.sumelectzpe: -1404.232134 hartree
zpe.sumelectthermal: -1404.201938 hartree
zpe.sumelectthermalent: -1404.200993 hartree
zpe.sumelectthermalfe: -1404.298921 hartree
dipole: -3.6231 -1.6424 2.0540
dipole: 4.4770
quadrupole: -131.5704 -151.6626 -157.4537
quadrupole: 16.0375 4.6242 4.5586
quadrupole: 15.3252 -4.7670 -10.5582 16.0375 4.6242 4.5586
hfenergy: -1404.6892717 hartree
pointgroup: C01 [X(C16H28N6O6)]
dipole: -1.094909 1.0525178 0.8920872 debye
polarizability: 262.0345801|-21.468786|251.3364814|-0.0735284|-11.5928221|196.1564709 unknown
InChI: InChI=1S/C16H28N6O6/c17-9(5-6-12(23)24)13(25)21-10(3-1-7-20-16(18)19)14(26)22-8-2-4-11(22)15(27)28/h9-11,21,23,27H,1-8,17-19H2
charge 0 multiplicity 1
56 atoms
O  -0.026671 -1.723428 -1.273955
O  2.376328 -5.021874 -1.801688
O  0.807085 -5.221688 -0.100596
O  1.343852 0.701104 1.015712
O  2.753935 2.965595 -3.21806
O  0.851853 4.083137 -2.505665
N  1.198717 -2.444144 0.552568
N  -0.936276 0.405729 0.640895
N  -0.970295 3.323915 1.211371
N  -3.515819 1.050493 0.4069
N  -5.453688 2.147316 -0.505699
N  -3.440743 3.325163 -0.146965
C  2.160103 -3.132813 -0.325787
C  3.459855 -3.188839 0.530297
C  1.661503 -2.385889 1.967628
C  2.919686 -3.289199 1.979393
C  -0.849604 -1.037566 0.939089
C  0.158145 -1.735452 -0.014277
C  -2.221537 -1.736182 0.729916
C  1.66978 -4.538634 -0.689761
C  -3.419262 -1.15865 1.533995
C  0.190492 1.167412 0.684801
C  0.017561 2.658264 0.28742
C  -4.291257 -0.159145 0.736602
C  1.376706 3.395255 0.283569
C  2.31969 2.95167 -0.851084
C  1.865509 3.40199 -2.223437
C  -4.122459 2.126292 -0.077111
H  2.289973 -2.574139 -1.267388
H  4.118533 -4.025113 0.245092
H  4.013047 -2.243822 0.387105
H  1.894466 -1.334716 2.220169
H  0.888168 -2.765799 2.658844
H  3.654986 -2.955169 2.730388
H  2.638343 -4.332345 2.21004
H  -0.523791 -1.170091 1.98911
H  -2.075401 -2.800526 0.996255
H  -2.445049 -1.714361 -0.353666
H  -1.946414 0.803486 0.462315
H  -4.075069 -1.9947 1.847209
H  -3.065941 -0.665681 2.461039
H  -0.410698 2.69714 -0.7331
H  -4.650357 -0.682723 -0.181863
H  -5.194275 0.092426 1.340124
H  1.181904 4.482276 0.187682
H  1.882095 3.210336 1.248518
H  2.053248 -5.937651 -2.020704
H  3.339853 3.350994 -0.693057
H  2.427622 1.851572 -0.843151
H  -0.694969 4.293035 1.422893
H  -1.113827 2.798217 2.083661
H  2.418169 3.263053 -4.107133
H  -5.955223 3.025888 -0.605103
H  -5.964799 1.27847 -0.629011
H  -3.694377 4.012519 -0.854651
H  -2.503406 3.379795 0.347213
