program: Gaussian 09
title: 000131429
version: EM64L-G09RevD.01
frameworkgroup: C1[X(C16H18N2O2)]
method: RPBEPBE
basis: SDD
operation: Freq
keyword: #p
keyword: freq=noraman
keyword: PBEPBE/SDD
title: #p freq=noraman PBEPBE/SDD
converged: YES YES NO NO
title: Mulliken charges:
elementType: O O N N C C C C C C C C C C C C C C C C H H H H H H H H H H H H H H H H H H
charge: -0.286851 -0.399121 -0.343718 -0.136934 0.334596 0.335178 0.421439 -0.412929 -0.413742 -0.392097 -0.397798 -0.787062 -0.788570 0.507363 -0.377138 -0.397250 -0.266291 -0.354648 0.240523 -0.603200 0.246141 0.245893 0.258661 0.260202 0.239027 0.238063 0.225943 0.237893 0.225466 0.239068 0.231806 0.240557 0.269118 0.252562 0.222007 0.243650 0.277944 0.364250
chargesum: 0.00000
title: Mulliken charges with hydrogens summed into heavy atoms:
elementType: O O N N C C C C C C C C C C C C C C C C
charge: -0.286851 -0.034872 -0.343718 -0.136934 0.334596 0.335178 0.421439 -0.166788 -0.167849 -0.133437 -0.137595 -0.084029 -0.086144 0.507363 -0.145332 -0.156693 0.002828 -0.102086 0.240523 0.140401
polarizability: 3.94948107e+02 -3.64583061e+00 1.79664536e+02 1.72960576e+00 1.12545573e+01 1.20887680e+02
1716.lowfreq: -3.8461 -0.0004 0.0004 0.0008 2.0132 3.8395 19.6595 32.9318 46.5110
frequency: 19.6372 32.9224 46.5006 52.3448 69.3587 80.9130 110.5489 115.5760 128.3449 133.0576 159.3124 167.0028 169.8077 215.7393 222.3479 230.7558 266.3865 282.5401 326.3671 342.2238 356.6645 371.6731 391.1633 414.7825 437.1836 464.7600 521.7944 547.6814 567.6596 586.7463 614.8752 616.2304 650.7334 660.6440 665.5927 710.8972 753.9041 773.1392 779.7315 837.2360 838.9497 842.7708 859.8790 899.8832 948.0197 959.9007 962.9100 966.7463 975.9819 991.2378 1013.5778 1016.6563 1027.2753 1039.7442 1043.0354 1047.2061 1064.5817 1113.1403 1118.6487 1132.7630 1187.6992 1216.1463 1216.6651 1247.0253 1260.9004 1292.5592 1303.5804 1311.2537 1323.4991 1327.7142 1365.7116 1376.5087 1392.1610 1404.4333 1406.9169 1409.9707 1420.5484 1463.0101 1464.5458 1468.1071 1473.5552 1476.6329 1482.9325 1510.0837 1543.0376 1552.8608 1563.1453 1584.3904 1616.8985 1643.4227 2969.0500 2970.3774 2982.4984 3038.9932 3039.7267 3068.3134 3090.0381 3090.4539 3100.3227 3120.7880 3130.4567 3137.4155 3158.3189 3163.0638 3167.0268 3201.2677 3221.9087 3469.2155
redmass: 4.7159 4.7646 4.8574 3.0696 3.3034 3.0617 2.6687 1.2219 1.4528 1.9051 2.0506 1.9179 4.9120 3.4919 4.3482 3.7602 3.3488 3.0048 3.3193 1.6975 2.2373 3.2126 4.7586 2.9203 4.6323 3.1010 4.7612 2.6519 5.9569 4.7834 3.1225 5.7359 5.9607 5.3516 4.9799 4.2451 4.0722 1.2135 6.4192 1.2972 1.3132 1.6502 4.0831 1.9445 3.0116 1.6863 1.7740 1.5270 1.4004 4.8562 2.2452 1.1737 2.0080 1.4114 1.4003 1.4546 3.6997 1.4320 1.4413 1.7893 1.1279 1.4190 1.4693 4.9244 2.0400 1.5903 1.7439 1.5778 3.4616 2.2906 3.1625 3.4339 2.9927 1.2270 1.2985 1.3841 3.4548 1.0540 1.0512 1.0488 1.0943 1.1916 1.1150 2.9610 5.2772 8.8536 6.4361 5.8608 6.2747 5.8790 1.0387 1.0385 1.0337 1.0976 1.0976 1.1027 1.0965 1.0964 1.0896 1.0986 1.0891 1.0878 1.0958 1.0967 1.0911 1.0926 1.1038 1.0685
irintensity: 1.7307 0.7171 0.0999 3.0547 2.0025 1.7382 1.9482 1.5401 1.3709 0.7926 2.8094 2.4798 0.5482 13.8136 10.0056 1.6261 2.7453 1.1976 0.6719 144.3717 84.0080 2.4903 7.9297 2.0361 0.8581 4.7700 15.3515 19.0049 0.1349 4.3726 13.2698 1.9219 1.5571 10.9896 0.5340 0.5010 3.4859 69.3604 13.2325 3.2720 0.1400 65.6037 8.5396 4.1000 2.5165 2.2309 0.9047 0.6121 1.0447 26.1442 2.8544 50.4144 2.3654 1.0621 1.2896 7.1220 54.3427 29.2169 43.4450 135.6810 17.1954 7.2104 24.9960 27.3768 16.1276 6.0824 22.3284 13.2585 39.7453 11.9155 113.4746 207.6209 178.4690 12.0745 87.4291 7.3855 28.9590 8.3776 22.8989 26.0126 15.0032 10.3063 16.2568 233.8947 26.0546 202.5058 15.6683 5.4858 90.5787 120.7806 73.3931 14.7898 78.0316 5.3975 38.7344 32.8988 11.3724 46.9158 1.2718 2.2754 9.2821 11.9810 13.9909 1.8285 18.1517 9.2788 7.6379 9.7726
temp: 298.150 k
press: 1.00000 atm
elementType: 8 8 7 7 6 6 6 6 6 6 6 6 6 6 6 6 6 6 6 6 1 1 1 1 1 1 1 1 1 1 1 1 1 1 1 1 1 1
symmnumber: 1
zpe: 796610.3 jmol-1
zpe.correction: 0.303413 hartree
zpe.thermalcorrener: 0.323872 hartree
zpe.thermalcorrenthalpy: 0.324817 hartree
zpe.thermalcorrgfe: 0.252558 hartree
zpe.sumelectzpe: -878.943389 hartree
zpe.sumelectthermal: -878.922929 hartree
zpe.sumelectthermalent: -878.921985 hartree
zpe.sumelectthermalfe: -878.994244 hartree
dipole: -1.2030 2.8927 0.3365
dipole: 3.1509
quadrupole: -112.9996 -108.5745 -122.7861
quadrupole: -18.6982 -3.6997 -2.1158
quadrupole: 1.7871 6.2122 -7.9994 -18.6982 -3.6997 -2.1158
hfenergy: -879.2468019 hartree
pointgroup: C01 [X(C16H18N2O2)]
dipole: -0.4564674 -1.1440562 -0.139882 debye
polarizability: 394.7844973|6.8938598|179.6571899|-2.2802212|11.6390129|121.0586359 unknown
InChI: InChI=1S/C16H18N2O2/c1-12-4-5-13(2)18(12)15-9-6-14(7-10-15)8-11-16(19)17(3)20/h4-11,20H,1-3H3
charge 0 multiplicity 1
38 atoms
O  -5.070404 1.311328 0.861097
O  -5.326017 -1.720973 -1.099893
N  3.391982 -0.073601 -0.049409
N  -5.720386 -0.643473 -0.192282
C  4.274965 0.886941 -0.607685
C  4.128496 -1.220063 0.34599
C  1.97305 0.086941 0.085513
C  5.558328 0.335982 -0.563861
C  5.468725 -0.97071 0.038982
C  1.086006 -0.82687 -0.543824
C  1.439377 1.161413 0.83894
C  3.80749 2.192713 -1.18957
C  3.504482 -2.397291 1.04385
C  -0.858126 0.406731 0.335328
C  -0.304311 -0.671237 -0.416603
C  0.045376 1.317664 0.954514
C  -2.30102 0.623771 0.496385
C  -3.315106 -0.152116 0.004822
C  -4.723138 0.2474 0.25064
C  -7.130663 -0.259032 -0.32071
H  6.458338 0.822191 -0.938249
H  6.29226 -1.654309 0.241669
H  1.499326 -1.638946 -1.150434
H  2.119485 1.85379 1.344658
H  4.642864 2.6607 -1.736723
H  2.97065 2.057258 -1.900904
H  3.468021 2.915796 -0.423324
H  2.891628 -2.089897 1.912696
H  2.852728 -3.00192 0.384508
H  4.305012 -3.05962 1.4135
H  -0.967296 -1.381291 -0.92239
H  -0.358279 2.150704 1.542256
H  -2.606649 1.509129 1.073526
H  -3.138965 -1.050222 -0.592919
H  -7.790181 -1.052049 0.07434
H  -7.383008 -0.067371 -1.380127
H  -7.268822 0.662583 0.26576
H  -5.407719 -2.551445 -0.553866
