program: Gaussian 09
title: 000131426
version: EM64L-G09RevD.01
frameworkgroup: C1[X(C25H26O2)]
method: RPBEPBE
basis: SDD
operation: Freq
keyword: #pfreq=noraman
keyword: PBEPBE/SDD
title: #p freq=noraman PBEPBE/SDD
converged: YES YES NO NO
title: Mulliken charges:
elementType: O O C C C C C C C C C C C C C C C C C C C C C C C C C H H H H H H H H H H H H H H H H H H H H H H H H H H
charge: -0.178235 -0.249474 -0.157451 0.300964 -0.257339 -0.115588 -0.520004 -0.538818 0.083407 -0.518103 0.047135 -0.519251 0.316700 -0.796199 0.581591 -0.606883 -0.770486 -0.167094 0.299205 -0.636432 -0.407383 0.163803 -0.404786 -0.421197 -0.235523 -0.235985 -0.242042 0.225596 0.227973 0.240754 0.223283 0.229858 0.218010 0.224656 0.250866 0.231380 0.249169 0.250614 0.247870 0.227773 0.231032 0.254616 0.244410 0.221825 0.247897 0.236883 0.264425 0.253011 0.250312 0.241000 0.229818 0.229440 0.232998
chargesum: 0.00000
title: Mulliken charges with hydrogens summed into heavy atoms:
elementType: O O C C C C C C C C C C C C C C C C C C C C C C C C C
charge: -0.178235 -0.249474 0.068144 0.300964 -0.029366 0.125165 -0.066863 -0.096152 0.083407 -0.035856 0.047135 -0.019468 0.316700 -0.089524 0.581591 -0.352266 -0.056354 0.069789 0.299205 -0.372007 -0.154372 0.163803 -0.154475 -0.180198 -0.005705 -0.006545 -0.009044
polarizability: 3.89060926e+02 -2.87029797e+01 2.72737213e+02 -3.07013404e+01 -1.96773416e+01 1.95962009e+02
1716.lowfreq: 0.0004 0.0009 0.0010 3.1615 6.0470 15.8630 36.2401 49.6184 57.9669
frequency: 36.1372 49.6144 57.9311 63.2738 68.6404 85.4011 125.0130 137.9135 166.0754 175.8237 192.0934 207.6278 210.4466 227.2191 230.2421 247.1411 257.2042 261.4139 275.8106 289.8924 304.2371 310.4513 366.4811 369.3810 381.7614 405.7459 424.3674 436.2327 457.9174 471.4576 494.5708 521.0159 528.3481 541.0460 552.6298 560.1473 580.9881 602.5741 616.1965 634.8628 644.8676 658.2266 686.8234 702.9514 710.8342 719.1452 760.0081 772.8021 811.6307 814.6657 827.7626 830.5335 853.4835 860.4235 879.4749 888.4898 892.7862 918.3904 921.0620 933.8376 940.9592 948.8035 976.7111 976.8422 982.4858 987.6142 994.5542 995.3750 995.9163 1001.4180 1008.4069 1027.6362 1033.6016 1053.2908 1066.9635 1076.8552 1084.1869 1096.5150 1112.3712 1126.9797 1139.1648 1145.5970 1162.1408 1174.1303 1176.3613 1189.9162 1194.3325 1198.4192 1224.2496 1231.0354 1235.5035 1255.9543 1258.4392 1261.6035 1277.7049 1288.4847 1292.0323 1307.0411 1311.8551 1313.1968 1322.1862 1337.6426 1342.3564 1348.1771 1364.9557 1370.2337 1375.4847 1384.4055 1386.3520 1390.3513 1427.8077 1434.5637 1461.6432 1470.2300 1473.6362 1476.2184 1481.3772 1482.2530 1486.2049 1495.4565 1540.6510 1577.2982 1586.3383 1605.7994 1611.2856 1647.6061 1654.4896 2920.0903 2941.8506 2958.6373 2983.6040 2984.3407 2987.7613 2989.8586 2995.5388 3027.1373 3046.1968 3054.6575 3062.8902 3082.2500 3084.2272 3085.3147 3093.9353 3094.2635 3108.6113 3110.4747 3122.4754 3126.4814 3128.3843 3139.5884 3148.5466 3150.8519 3166.1263
redmass: 5.5786 5.0518 4.5766 4.2961 4.4857 4.3043 3.3421 5.1410 2.4299 3.0563 3.0075 1.6519 4.0205 3.4218 3.0024 3.6317 3.0058 1.2074 2.5851 2.7171 3.7167 3.8727 3.9322 2.6008 3.5791 2.8623 4.1326 2.7913 3.4398 4.1617 3.1746 3.1559 3.6170 2.3771 4.3186 3.4108 5.2373 4.0400 6.2352 4.8207 3.8281 4.9264 2.9403 1.8841 2.5466 4.0676 3.4837 1.9855 1.5252 2.3670 2.1893 2.2355 1.2642 2.3278 1.6075 2.7954 2.2287 2.2083 1.4862 1.6890 2.1446 1.6861 1.9693 1.4795 2.2832 5.5600 1.4646 1.7488 1.4896 2.2440 2.0935 2.4909 2.2407 2.1355 2.9926 1.8950 1.6560 2.0955 2.9919 1.8844 1.7363 2.2289 1.9296 1.0885 1.8942 1.6145 1.2290 1.3935 1.6896 1.7149 1.6277 1.4315 1.8062 1.7250 1.5894 1.5144 2.4618 1.4633 1.4985 1.3200 1.3943 1.3824 1.6989 1.5428 1.5953 1.5539 3.5725 2.4511 1.1881 1.3393 1.0792 2.3246 1.0732 1.0767 1.0647 1.0945 1.7092 1.2310 1.0600 1.0811 8.8886 6.0329 7.8198 6.6006 6.8829 7.2089 12.0298 1.0807 1.0792 1.0830 1.0608 1.0557 1.0362 1.0422 1.0639 1.0634 1.0959 1.1019 1.0962 1.0994 1.0987 1.0998 1.1025 1.1003 1.0861 1.0900 1.0855 1.0870 1.0915 1.0917 1.0963 1.0975 1.1015
irintensity: 2.1598 2.0162 1.3893 0.2705 1.1106 1.8633 1.7628 2.9205 0.8145 0.8102 1.0429 0.4181 1.3457 1.7006 1.8781 0.3982 1.0383 0.3614 1.4915 1.1329 1.0810 0.5293 1.4899 2.0673 6.6054 1.1239 0.4254 0.6727 3.3153 5.4117 3.6167 3.9403 7.1501 1.4492 8.4320 4.0206 1.1651 8.7848 0.1700 4.5963 0.4128 0.8977 10.3409 39.4548 7.3718 8.8011 3.0257 49.2894 18.2287 2.2827 10.6830 17.1344 1.6601 3.8512 3.2827 2.0143 0.3839 4.3764 28.5756 21.9375 7.5091 2.0293 6.5275 2.1035 7.3131 0.2383 4.6687 2.5369 1.3595 29.4221 9.8598 15.4881 4.5488 11.1541 12.1968 20.0906 12.1991 10.4265 2.9609 11.9895 18.2724 0.4194 8.7856 1.4977 16.6677 1.6667 0.4400 2.5616 5.5593 15.3726 6.5321 2.1417 5.6520 17.8846 3.8272 2.0717 67.5572 2.3328 5.5750 2.6065 6.7583 5.5315 3.8115 2.7605 1.3999 8.0311 3.5529 54.5678 27.4754 13.3928 18.9371 7.1931 5.5856 9.0104 9.0848 7.0368 3.0236 17.3356 14.3462 11.9981 238.5804 17.8779 80.6850 0.9944 22.8708 159.1655 189.4129 8.2316 2.6234 22.8004 19.8115 11.1572 10.7133 51.8792 14.9176 24.1484 26.5634 36.1438 8.8932 27.1813 26.9320 22.8158 15.1258 18.5837 14.4849 9.2758 7.8089 0.7709 10.2697 9.2995 33.4182 20.6133 29.0623
temp: 298.150 k
press: 1.00000 atm
elementType: 8 8 6 6 6 6 6 6 6 6 6 6 6 6 6 6 6 6 6 6 6 6 6 6 6 6 6 1 1 1 1 1 1 1 1 1 1 1 1 1 1 1 1 1 1 1 1 1 1 1 1 1 1
symmnumber: 1
zpe: 1155995.0 jmol-1
zpe.correction: 0.440295 hartree
zpe.thermalcorrener: 0.463411 hartree
zpe.thermalcorrenthalpy: 0.464355 hartree
zpe.thermalcorrgfe: 0.389393 hartree
zpe.sumelectzpe: -1116.741086 hartree
zpe.sumelectthermal: -1116.717970 hartree
zpe.sumelectthermalent: -1116.717026 hartree
zpe.sumelectthermalfe: -1116.791988 hartree
dipole: -5.0358 1.5001 2.9980
dipole: 6.0496
quadrupole: -198.3402 -167.1562 -156.2137
quadrupole: -27.6900 6.3640 -8.9967
quadrupole: -24.4368 6.7471 17.6897 -27.6900 6.3640 -8.9967
hfenergy: -1117.1813808 hartree
pointgroup: C01 [X(C25H26O2)]
dipole: 1.928426 0.6415161 -1.2387355 debye
polarizability: 386.2486955|30.6982058|269.9589159|-37.9067133|22.52187|201.5525362 unknown
InChI: InChI=1S/C25H26O2/c1-24-12-10-18(26)14-17(24)15-19(16-6-4-3-5-7-16)23-20-8-9-22(27)25(20,2)13-11-21(23)24/h3-7,10,12,14-15,20-21,23H,8-9,11,13H2,1-2H3
charge 0 multiplicity 1
53 atoms
O  3.273554 -4.125251 0.689918
O  -5.862467 0.775767 1.504775
C  1.456763 -1.03918 0.358767
C  1.700377 -2.44994 -0.275796
C  0.290282 -0.298012 -0.371012
C  -0.983308 -1.186539 -0.115739
C  0.441772 -3.330005 -0.136652
C  -0.804354 -2.607605 -0.714956
C  -2.313805 -0.449653 -0.533279
C  2.890693 -0.46359 0.537306
C  2.933589 -2.930379 0.518199
C  3.681825 -1.696094 1.057957
C  0.072161 1.159584 0.045389
C  2.17169 -2.395869 -1.76429
C  -2.392925 0.813331 0.326866
C  -1.174699 1.609582 0.418931
C  -2.278766 -0.026737 -2.047544
C  -3.545221 -1.322837 -0.375825
C  1.198289 2.13611 -0.026034
C  -3.558852 1.211722 0.944439
C  -4.680838 -0.928157 0.266605
C  -4.782099 0.392567 0.938807
C  1.406275 3.096028 1.004062
C  2.053985 2.175505 -1.162404
C  2.433943 4.057883 0.903259
C  3.073933 3.144358 -1.26958
C  3.272721 4.088561 -0.235409
H  1.087914 -1.223557 1.3944
H  0.515365 -0.307863 -1.460273
H  -1.05558 -1.315187 0.986678
H  0.268078 -3.549733 0.935555
H  0.592133 -4.303649 -0.638669
H  -0.737374 -2.551946 -1.81931
H  -1.690785 -3.22497 -0.483234
H  2.922423 0.382333 1.242106
H  3.31184 -0.101583 -0.415983
H  3.666838 -1.749285 2.164784
H  4.744675 -1.720901 0.758506
H  2.452299 -3.412991 -2.09147
H  1.371413 -2.035149 -2.433318
H  3.050251 -1.74181 -1.906088
H  -1.286526 2.651539 0.746592
H  -1.442181 0.664161 -2.24796
H  -2.172136 -0.912947 -2.698848
H  -3.217087 0.48675 -2.318175
H  -3.530844 -2.287956 -0.898858
H  -3.601771 2.147074 1.516782
H  -5.574458 -1.562106 0.30428
H  0.773037 3.068054 1.898388
H  1.903279 1.46187 -1.980534
H  2.583167 4.779895 1.713865
H  3.710795 3.165841 -2.161053
H  4.068714 4.836864 -0.315424
