program: Gaussian 09
title: 000131425
version: EM64L-G09RevD.01
frameworkgroup: C1[X(C15H19NO)]
method: RPBEPBE
basis: SDD
operation: Freq
keyword: #p
keyword: freq=noraman
keyword: PBEPBE/SDD
title: #p freq=noraman PBEPBE/SDD
converged: YES YES NO NO
title: Mulliken charges:
elementType: O N C C C C C C C C C C C C C C C H H H H H H H H H H H H H H H H H H H
charge: -0.258696 -0.027929 -0.360789 -0.347637 -0.404338 -0.355318 -0.313572 -0.693672 0.381264 0.430659 -0.017242 -0.491114 -0.358580 -0.403825 -0.318929 -0.192610 -0.370721 0.187673 0.187304 0.191163 0.191182 0.216192 0.216410 0.194773 0.194597 0.205978 0.206256 0.216593 0.210787 0.210877 0.282187 0.250903 0.231261 0.243233 0.227607 0.238071
chargesum: 0.00000
title: Mulliken charges with hydrogens summed into heavy atoms:
elementType: O N C C C C C C C C C C C C C C C
charge: -0.258696 -0.027929 0.014188 0.034709 0.028264 0.034052 0.098663 -0.055415 0.381264 0.430659 -0.017242 -0.208926 -0.107677 -0.172563 -0.075697 0.034997 -0.132650
polarizability: 2.94194755e+02 -8.47078881e+00 1.60794676e+02 8.47185903e-01 -6.27235656e-02 9.47631210e+01
1716.lowfreq: -0.0006 -0.0005 0.0007 4.4159 6.5242 20.3655 25.2339 39.0852 56.9271
frequency: 23.9994 39.0307 55.8478 65.1631 113.8014 117.5635 122.1601 147.3015 148.9856 181.7751 191.6415 225.0028 237.8574 289.3865 336.8308 385.8743 411.2929 421.5381 473.3928 479.6865 522.1168 536.7546 561.2930 606.1717 661.5663 720.4088 727.9627 752.4621 753.1418 776.5678 785.2023 811.4033 838.9883 880.2676 891.3414 895.2399 895.8560 926.5250 938.8330 951.8147 981.3652 982.3057 991.9026 1013.1571 1025.7899 1047.5396 1071.9534 1085.6339 1105.3707 1126.0852 1146.8967 1154.8947 1166.9774 1196.5382 1229.3091 1239.7942 1244.5900 1248.3622 1258.9742 1282.7771 1292.4899 1296.9122 1296.9464 1340.0631 1345.2351 1357.7994 1365.8346 1382.1164 1389.3865 1402.7795 1438.6495 1448.4246 1466.0570 1467.7643 1472.5897 1476.3892 1479.0440 1486.3868 1491.7709 1504.4488 1546.5067 1590.7949 1633.5829 2946.5052 2955.0446 2960.1747 2970.3391 2973.5593 2992.3545 2996.9776 3005.0725 3008.3096 3033.8365 3064.6523 3070.3700 3073.0476 3116.7876 3124.3943 3126.2119 3164.8874 3169.0496 3181.7301
redmass: 4.8700 4.3380 2.0099 2.6449 1.9483 2.9657 3.8758 3.3404 2.0553 5.0624 3.5108 1.1332 3.6903 5.6940 4.0368 4.6236 3.6173 3.2954 2.8599 3.8086 6.7570 3.2965 5.3105 7.6487 3.2508 7.3714 1.0672 4.8272 1.1197 1.4867 1.8844 1.1753 1.7464 4.0183 2.1429 1.2366 1.5271 5.3305 1.3776 1.3669 1.3861 3.8307 1.1382 3.7088 2.5133 3.0634 2.6606 2.0953 1.9609 2.7821 1.4186 1.3830 1.4264 1.5446 2.1417 1.3022 2.0022 1.2963 1.9507 1.0745 1.1314 1.1248 1.2795 1.9679 1.9252 1.6341 2.7142 1.5071 1.2163 2.1021 2.7168 4.6508 1.0732 1.0727 1.0837 1.0424 1.0933 1.1108 1.1243 2.9380 7.9335 5.7850 7.1207 1.0550 1.0587 1.0588 1.0594 1.0362 1.0979 1.0593 1.1052 1.1028 1.1046 1.1048 1.1009 1.0993 1.0889 1.0898 1.0901 1.0986 1.0936 1.0925
irintensity: 0.1945 0.2185 0.0590 1.8474 0.9424 0.3615 0.1472 0.3817 1.0733 0.7586 0.0142 0.0033 0.9044 4.9594 2.5017 0.2223 1.0841 2.8592 11.0094 0.8693 0.0985 0.0932 9.3834 6.7047 4.5741 15.8511 11.9376 1.0502 0.5209 13.0141 6.7779 7.9871 66.0060 9.2076 1.4285 13.3975 24.2959 1.7714 0.3509 0.9062 2.5287 93.2665 0.3176 5.2441 2.9890 14.4099 8.5265 5.0990 59.5500 9.0753 1.2104 145.6330 18.9111 0.0022 85.1831 15.2063 24.9682 0.0151 177.2931 0.0037 0.0283 1.1336 1.0680 29.1222 12.8131 0.5053 0.4865 14.6036 12.0729 4.7348 23.1301 0.0337 0.3010 0.6561 13.8256 12.6427 6.4745 30.3540 30.6565 113.4443 14.1574 12.7837 201.3132 30.4218 10.8538 7.1250 93.0383 39.7837 1.7474 37.6346 25.2771 0.4839 37.4980 45.5440 122.8144 53.6502 24.2160 3.9707 21.6415 35.0489 13.1302 2.3034
temp: 298.150 k
press: 1.00000 atm
elementType: 8 7 6 6 6 6 6 6 6 6 6 6 6 6 6 6 6 1 1 1 1 1 1 1 1 1 1 1 1 1 1 1 1 1 1 1
symmnumber: 1
zpe: 797954.3 jmol-1
zpe.correction: 0.303925 hartree
zpe.thermalcorrener: 0.320501 hartree
zpe.thermalcorrenthalpy: 0.321445 hartree
zpe.thermalcorrgfe: 0.258152 hartree
zpe.sumelectzpe: -711.704170 hartree
zpe.sumelectthermal: -711.687594 hartree
zpe.sumelectthermalent: -711.686649 hartree
zpe.sumelectthermalfe: -711.749942 hartree
dipole: -1.6918 3.7539 0.0179
dipole: 4.1176
quadrupole: -87.7255 -101.5844 -105.6885
quadrupole: 8.4018 0.1114 -0.0683
quadrupole: 10.6073 -3.2516 -7.3557 8.4018 0.1114 -0.0683
hfenergy: -712.0080945 hartree
pointgroup: C01 [X(C15H19N1O1)]
dipole: -0.6715145 1.4694388 -0.1189187 debye
polarizability: 294.1802153|-7.5918151|160.2984162|4.6938386|-5.3125327|95.273921 unknown
InChI: InChI=1S/C15H19NO/c1-2-3-4-5-11-17-14-9-8-13-7-6-10-16-15(13)12-14/h6-10,12H,2-5,11H2,1H3
charge 0 multiplicity 1
36 atoms
O  -0.669406 -0.605104 -0.059603
N  4.017477 -1.598162 0.129356
C  -4.351881 0.387655 -0.163494
C  -5.65425 -0.443994 -0.133341
C  -3.08211 -0.492549 -0.10322
C  -6.932676 0.423316 -0.18536
C  -1.800184 0.341415 -0.143314
C  -8.228301 -0.416157 -0.156401
C  0.634646 -0.094179 -0.069489
C  3.342121 0.793192 -0.076563
C  3.025999 -0.621573 0.027488
C  1.665401 -1.039678 0.028191
C  0.937324 1.306528 -0.172185
C  2.267463 1.730429 -0.175279
C  4.722569 1.172964 -0.073744
C  5.705577 0.186731 0.028837
C  5.298712 -1.185092 0.128369
H  -4.354233 1.098335 0.689505
H  -4.336041 1.0055 -1.085922
H  -5.657424 -1.151862 -0.988103
H  -5.671192 -1.066254 0.785517
H  -3.073048 -1.20344 -0.951387
H  -3.084967 -1.097991 0.823265
H  -6.929004 1.129887 0.669705
H  -6.913862 1.04573 -1.103397
H  -1.73374 0.920706 -1.088132
H  -1.759725 1.047263 0.712708
H  -9.127936 0.224989 -0.196793
H  -8.269217 -1.110953 -1.01643
H  -8.286595 -1.022898 0.766939
H  1.43587 -2.105071 0.107266
H  0.134253 2.045112 -0.248038
H  2.497347 2.800019 -0.254457
H  4.991909 2.233175 -0.152042
H  6.770653 0.438072 0.034679
H  6.056873 -1.97416 0.210371
