program: Gaussian 09
title: 000131422
version: EM64L-G09RevD.01
frameworkgroup: C1[X(C21H24ClNO3)]
method: RPBEPBE
basis: SDD
operation: Freq
keyword: #p
keyword: freq=noraman
keyword: PBEPBE/SDD
title: #p freq=noraman PBEPBE/SDD
converged: YES YES NO NO
title: Mulliken charges:
elementType: Cl O O O N C C C C C C C C C C C C C C C C C C C C C H H H H H H H H H H H H H H H H H H H H H H H H
charge: -0.042069 -0.268217 -0.260206 -0.245630 -0.057871 -0.281255 -0.441380 0.333898 0.316474 -0.367943 0.368657 -0.579944 0.027299 0.172944 -0.515850 -0.365026 -0.543820 -0.635245 -0.465769 -0.311109 -0.401145 0.440786 -0.268712 -0.347412 -0.199246 -0.512250 0.255808 0.224573 0.193222 0.194801 0.205975 0.214661 0.226658 0.267662 0.245281 0.239957 0.237535 0.226907 0.224416 0.190528 0.257809 0.229199 0.223669 0.240586 0.226600 0.238426 0.196048 0.256739 0.198880 0.234103
chargesum: 0.00000
title: Mulliken charges with hydrogens summed into heavy atoms:
elementType: Cl O O O N C C C C C C C C C C C C C C C C C C C C C
charge: -0.042069 -0.268217 -0.260206 -0.245630 -0.057871 -0.025448 -0.023585 0.333898 0.316474 0.032833 0.368657 -0.138625 0.027299 0.172944 -0.248188 -0.119745 -0.066328 0.006605 -0.207959 0.141758 -0.160559 0.440786 -0.042111 -0.347412 0.235229 0.177472
polarizability: 2.72332098e+02 -1.67979977e+00 2.85201477e+02 -3.45661328e+00 1.41495694e+01 2.05364583e+02
1716.lowfreq: -4.7401 -2.1361 0.0018 0.0021 0.0022 7.2743 15.6893 20.0884 35.7715
frequency: 15.5438 19.9178 35.7453 47.1368 53.5386 55.7035 80.8413 93.4881 103.1564 132.4556 141.8193 149.1580 156.5906 178.0652 179.8143 192.5805 210.5295 224.1846 230.4203 247.8046 270.7703 293.5933 310.1344 311.7063 336.0194 354.8018 387.7114 399.5744 413.2397 445.6537 454.2088 459.7945 508.0008 533.5964 544.9020 551.1120 555.2674 571.8188 591.6923 626.0327 667.8093 673.4266 722.4606 726.9784 738.0410 751.4042 774.7853 794.9035 803.7672 811.2820 838.7055 868.3418 872.4570 879.7717 883.7577 901.1553 912.4128 927.9513 941.9523 961.9638 966.1185 978.7761 980.7427 1014.3535 1029.3172 1049.4705 1055.3349 1061.9939 1062.5746 1074.4309 1105.4540 1112.4150 1122.9422 1125.0659 1130.5132 1145.1198 1157.3776 1159.4025 1178.5272 1181.6960 1191.4114 1200.4207 1201.9429 1232.7576 1241.4733 1247.7578 1255.2601 1269.6557 1273.0900 1278.8778 1291.1699 1305.7857 1312.0989 1325.8352 1338.7498 1354.0638 1365.6954 1373.6435 1376.2516 1392.7865 1399.3429 1429.6618 1431.9483 1438.8833 1453.4956 1457.7871 1462.2138 1463.9687 1464.5632 1465.0854 1468.8339 1476.4825 1480.3218 1483.4181 1485.0769 1489.6777 1570.8985 1603.8495 1607.8721 1620.8410 2844.9055 2847.6539 2867.4717 2912.0092 2957.1343 2980.8350 2993.1590 2994.1123 3014.5600 3016.9433 3017.5662 3032.9120 3044.4361 3057.9595 3058.2959 3069.6945 3076.3495 3105.7895 3125.6906 3129.8530 3136.7882 3146.9390 3159.7619 3161.2867
redmass: 5.2093 5.0134 4.6082 3.3895 4.2107 4.7024 3.8832 2.1166 3.8615 3.9152 3.9472 1.6171 1.9778 3.9297 3.3032 5.5581 4.2092 2.9272 1.8078 2.4652 4.6211 3.7811 3.3975 6.3157 2.3167 2.5800 3.6394 3.9083 3.4330 3.9239 3.7534 3.5763 4.5878 3.5916 4.6389 5.2103 3.4960 3.1382 5.7879 5.5304 5.3308 4.4883 5.9548 4.0780 3.2985 3.2539 1.5093 3.9310 3.2488 2.7163 2.4736 2.3574 2.6337 2.0879 2.3667 3.9793 1.4157 2.6280 3.1200 2.8236 1.3358 2.8677 2.8868 3.0492 2.0386 1.8362 2.2231 2.0297 1.8223 2.5422 1.7428 1.4771 2.6243 2.0326 2.5078 2.2094 1.4980 1.1704 1.2564 1.3794 1.2518 1.4788 1.6424 1.4881 1.3767 1.2336 1.9133 2.1208 1.8154 2.5369 1.4524 1.5685 1.4867 1.3993 1.3706 1.4268 1.6552 2.8005 1.3785 3.3969 3.7990 1.1450 1.1593 2.6213 1.0519 1.0790 1.1310 1.0691 1.1580 1.1150 2.4700 1.1660 1.0693 1.1131 1.0564 2.6774 8.1861 7.1139 7.3914 8.1330 1.0712 1.0655 1.0601 1.0639 1.0385 1.0616 1.0628 1.0816 1.0660 1.0856 1.0761 1.0893 1.0989 1.0978 1.0992 1.0944 1.1007 1.1055 1.0861 1.1031 1.0918 1.0917 1.0968 1.0916
irintensity: 0.8830 0.1175 0.6399 1.2275 1.6297 0.8910 0.5444 1.7695 1.7987 6.5423 1.6666 1.6141 0.7841 2.7525 1.7503 0.9924 3.9531 1.5210 0.1152 0.3556 0.5102 4.4584 2.4922 7.5797 10.5869 2.3671 2.6261 2.6693 2.7390 5.0943 3.8780 5.7743 1.4842 0.1809 6.6324 1.8759 1.2320 5.6947 4.7167 0.7228 0.4781 4.5322 7.9058 2.1223 13.3365 30.9297 24.6206 9.6551 34.9817 11.3152 19.6152 80.6244 47.5781 23.0729 86.9530 59.0961 2.2564 34.6454 70.8456 20.4560 1.6495 32.6851 10.8904 42.9816 4.2367 6.4440 10.0394 42.4061 35.7367 19.7444 77.8372 5.7804 4.3107 124.8124 32.0976 28.4135 55.6396 1.2920 4.8998 3.4920 24.3995 28.1381 22.4719 16.8243 1.7459 2.9342 77.7244 28.9738 19.2464 23.3458 18.2855 18.2169 8.3488 22.5744 2.8399 0.6974 60.3488 15.0640 3.5369 10.7191 4.7558 19.2056 2.6458 65.1647 9.5435 0.8555 19.1238 15.7401 3.7211 12.4308 21.6722 9.2964 37.1587 6.3509 8.7691 103.3813 2.4165 9.1418 27.2770 2.5606 43.8648 51.6369 210.9657 57.4152 57.3119 21.1241 31.6486 2.0900 60.0064 24.6920 85.3103 39.8433 30.6559 24.4239 26.1896 33.4678 36.2640 28.0437 1.9799 27.9353 18.2289 5.0359 15.6834 14.3995
temp: 298.150 k
press: 1.00000 atm
elementType: 17 8 8 8 7 6 6 6 6 6 6 6 6 6 6 6 6 6 6 6 6 6 6 6 6 6 1 1 1 1 1 1 1 1 1 1 1 1 1 1 1 1 1 1 1 1 1 1 1 1
symmnumber: 1
zpe: 1064366.2 jmol-1
zpe.correction: 0.405396 hartree
zpe.thermalcorrener: 0.430107 hartree
zpe.thermalcorrenthalpy: 0.431052 hartree
zpe.thermalcorrgfe: 0.348754 hartree
zpe.sumelectzpe: -1553.143190 hartree
zpe.sumelectthermal: -1553.118478 hartree
zpe.sumelectthermalent: -1553.117534 hartree
zpe.sumelectthermalfe: -1553.199832 hartree
dipole: 4.4175 -2.2186 1.2839
dipole: 5.1073
quadrupole: -168.0932 -138.4548 -155.9354
quadrupole: -0.9058 -5.8478 -9.1886
quadrupole: -13.9320 15.7063 -1.7743 -0.9058 -5.8478 -9.1886
hfenergy: -1553.5485859 hartree
pointgroup: C01 [X(C21H24Cl1N1O3)]
dipole: -1.7377389 0.8471703 0.5478484 debye
polarizability: 272.5823416|-2.3847859|284.5783509|1.5446031|-15.4791|205.7374657 unknown
InChI: InChI=1S/C21H24ClNO3/c1-23-8-6-15-10-19(22)20(26-13-24-2)11-17(15)18(12-23)16-5-3-4-14-7-9-25-21(14)16/h3-5,10-11,18H,6-9,12-13H2,1-2H3
charge 0 multiplicity 1
50 atoms
Cl 4.829365 -1.722362 0.492126
O  -2.049409 1.1972 1.998384
O  3.469582 0.653022 -0.689484
O  4.115397 2.848966 -1.219408
N  -2.238885 -3.267167 -0.200942
C  -1.288781 -0.916928 0.049874
C  -1.937797 -1.98917 -0.888685
C  0.235646 -1.09918 0.162325
C  -1.698708 0.493769 -0.357877
C  -1.048968 -4.066305 0.178211
C  0.752979 -2.294682 0.739004
C  -0.162481 -3.392601 1.256816
C  -2.05419 1.454188 0.612715
C  -2.450418 2.774968 0.299082
C  1.131379 -0.111325 -0.308364
C  -1.756609 0.938189 -1.708408
C  -2.717609 3.529191 1.597147
C  -3.20988 -4.076811 -0.968273
C  2.157017 -2.461203 0.821584
C  -2.701835 2.385255 2.654291
C  -2.500192 3.187764 -1.042692
C  2.536993 -0.276944 -0.222962
C  -2.150669 2.252482 -2.052082
C  3.033381 -1.47126 0.350626
C  2.985349 2.02348 -1.003651
C  4.965195 3.016553 -0.025204
H  -1.722613 -1.107671 1.051932
H  -2.904237 -1.587268 -1.243651
H  -1.289195 -2.143532 -1.789362
H  -0.414936 -4.319759 -0.710706
H  -1.426002 -5.021253 0.591885
H  0.457195 -4.179634 1.725214
H  -0.840694 -3.004665 2.042846
H  0.720633 0.798742 -0.753392
H  -1.491116 0.235886 -2.507295
H  -1.921577 4.273183 1.790669
H  -3.682479 4.065393 1.593419
H  -4.125387 -3.485622 -1.14915
H  -3.490548 -4.971122 -0.383078
H  -2.82231 -4.42339 -1.959609
H  2.573502 -3.371393 1.265499
H  -2.112553 2.611713 3.555941
H  -3.722855 2.074305 2.941121
H  -2.80195 4.207113 -1.307919
H  -2.186716 2.548464 -3.105839
H  2.419248 2.020944 -1.951674
H  2.356433 2.366037 -0.149185
H  5.424778 2.054481 0.25892
H  4.374191 3.415462 0.825407
H  5.739432 3.741996 -0.31505
