program: Gaussian 09
title: 000131419
version: EM64L-G09RevD.01
frameworkgroup: C1[X(C22H15FN2O2)]
method: RPBEPBE
basis: SDD
operation: Freq
keyword: #p
keyword: freq=noraman
keyword: PBEPBE/SDD
title: #p freq=noraman PBEPBE/SDD
converged: YES YES NO NO
title: Mulliken charges:
elementType: F O O N N C C C C C C C C C C C C C C C C C C C C C C H H H H H H H H H H H H H H H
charge: -0.203700 -0.454627 -0.330568 -0.020096 -0.664619 -0.127888 0.353539 0.203150 0.337528 0.069903 -0.152139 0.348345 -0.448149 -0.392059 -0.513242 -0.404430 -0.395144 -0.290203 0.341568 0.331553 -0.396536 0.142921 -0.394721 -0.394579 -0.236579 -0.236863 -0.239561 0.278960 0.260049 0.331576 0.243607 0.240645 0.268905 0.260513 0.384252 0.341927 0.237958 0.240116 0.227358 0.227952 0.231807 0.391572
chargesum: 0.00000
title: Mulliken charges with hydrogens summed into heavy atoms:
elementType: F O O N N C C C C C C C C C C C C C C C C C C C C C C
charge: -0.203700 -0.063056 -0.330568 -0.020096 0.061560 -0.127888 0.353539 0.203150 0.337528 0.069903 -0.152139 0.348345 -0.169189 -0.132010 -0.181666 -0.160823 -0.154499 -0.021298 0.341568 0.331553 -0.136024 0.142921 -0.156763 -0.154462 -0.009221 -0.008911 -0.007754
polarizability: 5.32368104e+02 -2.68658372e+01 2.82983067e+02 -4.64271147e+00 -1.25504913e+01 1.15549537e+02
1716.lowfreq: -2.6236 -0.0006 -0.0003 0.0004 4.5780 5.6060 23.4120 30.0759 36.1478
frequency: 23.3949 30.0719 36.1349 53.3427 69.6413 83.9602 100.1724 117.0752 139.1578 153.4588 168.3870 202.5277 215.6313 269.9139 299.8586 313.2658 319.0417 362.4582 375.0710 392.9692 404.0260 408.1486 410.5775 419.5679 439.4809 449.6610 467.9695 497.1929 505.5175 518.1434 556.2612 577.1610 597.3401 602.1095 613.6353 619.7263 625.4576 634.9535 643.1249 694.7564 701.6301 717.1579 729.4941 735.3201 744.0610 769.9321 776.3929 792.1968 810.4728 815.5848 826.7605 850.2366 852.1567 859.3691 873.6188 902.9215 921.7852 959.3799 970.6644 974.5950 981.6798 988.8887 991.4467 995.6535 995.9057 1006.2872 1029.8058 1042.3919 1060.0488 1086.0343 1115.5600 1125.7572 1152.2985 1161.5652 1174.4247 1192.3879 1205.3411 1220.5195 1235.7150 1283.5184 1290.9437 1294.5846 1306.6294 1315.6300 1337.8253 1351.5118 1374.7918 1376.4616 1398.0320 1416.0604 1433.8858 1438.0970 1444.3739 1477.4323 1486.0987 1509.4306 1519.2864 1553.9666 1560.6015 1580.9026 1587.3111 1612.1807 1613.6159 1617.4239 1622.6302 3123.6640 3125.0305 3128.3906 3137.3803 3141.4364 3148.6521 3150.4107 3164.1926 3164.5688 3166.3041 3186.7531 3216.8839 3321.2638 3511.2411 3602.0413
redmass: 6.9438 4.3338 6.5738 6.8394 5.4065 4.7787 5.9371 5.7249 5.5787 7.2541 7.1057 10.1945 6.7684 6.1455 5.7882 6.8077 6.1391 6.5811 5.7007 7.7420 2.8834 4.8034 3.3571 3.6136 5.8075 6.0322 4.0040 3.5240 6.7063 4.1248 2.2985 1.3230 2.0872 3.7628 5.9341 2.6924 4.3250 6.3177 5.5616 5.1511 1.7607 6.5692 5.1987 4.9437 3.2918 2.5813 3.9391 2.2543 5.1887 1.3309 2.1005 1.2638 1.6510 1.3665 4.8959 1.4630 1.4478 1.3299 1.3473 1.4405 1.5216 4.0261 3.8123 2.6444 1.8193 4.0800 2.6862 1.9832 2.1332 1.6227 1.3425 1.4283 1.7615 2.5298 1.0532 1.1133 1.1579 1.9574 3.7245 2.0948 2.8125 4.9419 1.4187 1.4298 3.6746 2.9716 7.4585 3.7049 7.0833 4.0042 3.4827 2.6252 4.8460 2.2414 3.8955 3.2966 3.2972 6.0953 7.9400 5.4349 6.2851 5.9521 2.0710 4.6920 5.9952 1.0854 1.0865 1.0874 1.0883 1.0918 1.0957 1.0960 1.0886 1.0964 1.1013 1.0984 1.0914 1.0596 1.0636 1.0921
irintensity: 0.0466 0.0121 0.0544 0.1236 0.2498 0.1403 0.1415 0.8689 2.4805 0.0641 0.4418 0.3650 3.0287 0.5725 0.3996 1.3245 2.8842 10.2824 8.2584 4.6971 0.5939 2.0380 4.7975 8.0532 2.8623 1.4354 0.7041 0.9306 20.2820 32.7965 20.5964 28.0831 142.8442 43.8154 4.3204 55.6780 30.1795 11.5364 7.1381 6.9028 47.5178 2.0359 3.3210 2.7906 20.1154 43.8657 29.1980 0.7430 2.8243 145.7615 18.2784 2.0115 32.3671 13.8196 10.0277 47.8872 1.8102 1.1519 0.3307 0.5382 22.4787 0.6744 88.4681 6.3723 3.9325 8.8952 22.6728 64.8503 307.8216 8.5942 7.2001 8.7939 43.2521 104.2807 0.0135 0.0746 21.8248 2.8306 7.7788 18.8963 66.0222 131.3313 7.5911 1.6360 147.1163 5.3679 0.7759 34.4653 28.9890 9.7526 103.4157 9.3458 28.7411 29.0819 17.4986 112.1489 37.5557 51.8721 59.3373 370.6691 17.7404 1.7232 17.2661 16.8353 88.1615 19.5562 1.9335 2.7706 17.0198 9.1712 4.7538 43.6355 1.0317 4.7639 32.6748 5.2108 14.5617 138.9614 70.2991 151.7640
temp: 298.150 k
press: 1.00000 atm
elementType: 9 8 8 7 7 6 6 6 6 6 6 6 6 6 6 6 6 6 6 6 6 6 6 6 6 6 6 1 1 1 1 1 1 1 1 1 1 1 1 1 1 1
symmnumber: 1
zpe: 824509.5 jmol-1
zpe.correction: 0.314039 hartree
zpe.thermalcorrener: 0.335331 hartree
zpe.thermalcorrenthalpy: 0.336275 hartree
zpe.thermalcorrgfe: 0.262476 hartree
zpe.sumelectzpe: -1205.346240 hartree
zpe.sumelectthermal: -1205.324948 hartree
zpe.sumelectthermalent: -1205.324004 hartree
zpe.sumelectthermalfe: -1205.397803 hartree
dipole: -3.6546 1.4759 0.3932
dipole: 3.9609
quadrupole: -148.7493 -141.5396 -159.0899
quadrupole: 6.6318 0.8949 -4.9314
quadrupole: 1.0437 8.2533 -9.2970 6.6318 0.8949 -4.9314
hfenergy: -1205.6602792 hartree
pointgroup: C01 [X(C22H15F1N2O2)]
dipole: -1.4466489 -0.5773714 -0.0475768 debye
polarizability: 533.0449376|23.2447877|274.2470975|-4.1509114|-38.1183386|123.608673 unknown
InChI: InChI=1S/C22H15FN2O2/c23-16-10-11-18-17(12-16)19(22(26)27)20(24)21(25-18)15-8-6-14(7-9-15)13-4-2-1-3-5-13/h1-12,26H,24H2
charge 0 multiplicity 1
42 atoms
F  6.929669 1.780582 -0.124112
O  5.103612 -2.463601 0.302808
O  3.168089 -3.683046 0.197905
N  1.398973 1.125383 -0.253068
N  0.876389 -2.500634 -0.027733
C  0.79617 -0.058756 -0.10515
C  3.641477 0.053665 -0.053666
C  1.557868 -1.312299 -0.011763
C  -0.697915 -0.043917 -0.069683
C  2.995689 -1.249877 0.052517
C  2.784689 1.208862 -0.245568
C  -3.569817 0.120901 0.001253
C  -1.451366 -0.793021 0.87734
C  -1.404461 0.806627 -0.961173
C  5.052083 0.287217 -0.009536
C  -2.857342 -0.706953 0.911738
C  -2.808495 0.880134 -0.931732
C  3.338316 2.516412 -0.403781
C  -5.057599 0.199104 0.031146
C  5.533518 1.584419 -0.168344
C  4.718741 2.724517 -0.370672
C  3.70993 -2.527011 0.181741
C  -5.842013 -0.931363 0.393143
C  -5.734201 1.40572 -0.301657
C  -7.250725 -0.858894 0.422285
C  -7.14281 1.479457 -0.27382
C  -7.9094 0.34732 0.088343
H  -0.936987 -1.395932 1.634595
H  -0.831142 1.406144 -1.675055
H  5.750169 -0.534683 0.139557
H  -3.405494 -1.256962 1.684792
H  -3.325311 1.514096 -1.66068
H  2.634641 3.341898 -0.541978
H  5.169615 3.713286 -0.487039
H  1.432849 -3.368264 0.022093
H  -0.136148 -2.501904 -0.138224
H  -5.346987 -1.881816 0.622925
H  -5.153588 2.300899 -0.551607
H  -7.834701 -1.744906 0.695529
H  -7.64207 2.42195 -0.524861
H  -9.003212 0.404216 0.11007
H  5.4376 -3.398471 0.380823
