program: Gaussian 09
title: 000131414
version: EM64L-G09RevD.01
frameworkgroup: C1[X(C13H14O3)]
method: RPBEPBE
basis: SDD
operation: Freq
keyword: #pfreq=noraman
keyword: PBEPBE/SDD
title: #p freq=noraman PBEPBE/SDD
converged: YES YES NO NO
title: Mulliken charges:
elementType: O O O C C C C C C C C C C C C C H H H H H H H H H H H H H H
charge: -0.439842 -0.442895 -0.259358 -0.403545 -0.565045 -0.545404 -0.471755 0.385665 0.411684 0.515636 -0.439904 -0.440938 -0.484782 -0.233873 -0.244108 0.172117 0.231119 0.214279 0.205834 0.240755 0.202095 0.283030 0.222539 0.234124 0.226305 0.242540 0.228544 0.230327 0.343646 0.381210
chargesum: 0.00000
title: Mulliken charges with hydrogens summed into heavy atoms:
elementType: O O O C C C C C C C C C C C C C
charge: -0.096196 -0.061685 -0.259358 0.041853 -0.118456 -0.060278 -0.249216 0.385665 0.411684 0.515636 -0.205779 -0.214634 -0.242242 -0.005329 -0.013781 0.172117
polarizability: 1.86507948e+02 -2.80528988e+00 1.55616179e+02 1.07861838e+01 -5.65686608e+00 1.11082355e+02
1716.lowfreq: -5.6328 -0.0004 -0.0003 0.0004 7.5078 9.6087 35.8882 40.9298 68.4535
frequency: 35.8597 40.9169 68.4379 126.5405 153.9555 172.6964 193.0392 233.9592 257.3189 291.0828 305.4823 324.4931 347.8215 353.5561 387.9581 433.9225 467.8811 538.7342 549.3641 571.1131 584.3287 609.8763 636.7758 683.1300 693.8813 718.6903 755.4325 764.4791 788.4826 836.3815 855.4798 872.2525 882.6461 895.4885 904.0881 946.9769 952.8480 975.8363 989.8039 1029.1810 1054.2588 1069.9808 1082.9755 1099.7322 1146.8781 1163.4931 1173.4535 1177.3543 1209.0883 1220.9106 1227.3313 1274.2014 1286.1217 1305.0768 1316.5853 1328.2138 1343.7250 1349.4672 1358.7655 1382.6594 1390.2778 1439.2600 1457.3580 1463.5097 1470.1551 1487.0894 1590.1207 1596.7226 1610.7906 1658.4393 2972.1030 2982.3709 2983.7684 2992.5957 3043.7728 3052.1892 3110.2241 3115.3628 3119.9270 3121.1252 3139.3518 3161.5758 3508.0228 3538.1383
redmass: 6.5120 9.0029 4.0976 4.1256 3.6658 5.3054 3.8829 3.8147 4.5424 1.6681 2.0834 2.7696 3.5808 3.5882 6.5701 2.0295 3.5395 4.2635 3.4399 3.3027 1.4126 3.0556 3.4534 4.4220 3.4729 3.5385 2.0747 1.8112 3.2935 3.0560 4.6410 1.7389 1.5469 2.6338 1.6894 1.6117 2.2876 4.3283 1.3469 2.5043 2.1235 2.6391 2.0733 2.1432 1.3889 1.4689 1.3681 1.2399 1.5056 1.4848 1.3957 1.2666 1.4568 1.5103 1.3859 1.9558 1.5566 1.3134 1.5506 1.9147 2.2939 2.2826 1.1170 1.0976 1.1494 2.3016 6.5851 7.9257 6.4284 6.7528 1.0852 1.0673 1.0603 1.0609 1.1013 1.1020 1.0926 1.0866 1.0891 1.0889 1.0928 1.1006 1.0638 1.0661
irintensity: 0.4986 1.0780 0.5112 1.2695 3.6357 2.2841 1.2824 1.8651 2.3635 71.8857 74.5551 15.1134 3.5135 1.8240 1.7776 1.6135 6.2855 7.8882 47.7481 7.9962 103.2741 9.2617 8.6001 16.3815 11.2843 29.1074 26.7772 50.3649 23.7892 13.8996 41.0503 1.9044 2.7004 40.1597 19.4797 5.6348 4.5967 45.1707 0.6789 13.2110 7.0668 29.2445 71.4941 95.1904 40.2710 38.9998 11.4407 7.5906 22.3734 3.2003 0.3204 4.6704 10.4810 11.4647 15.1391 64.6574 2.5320 0.3917 3.8009 5.4199 0.2293 5.4612 13.8854 8.2264 20.8065 11.4276 0.5244 94.7390 6.6266 388.2155 37.0317 15.4695 26.7345 36.9408 35.6049 29.6305 1.8948 10.8510 4.5740 4.8974 26.7546 31.4261 32.1404 7.9407
temp: 298.150 k
press: 1.00000 atm
elementType: 8 8 8 6 6 6 6 6 6 6 6 6 6 6 6 6 1 1 1 1 1 1 1 1 1 1 1 1 1 1
symmnumber: 1
zpe: 632852.7 jmol-1
zpe.correction: 0.241041 hartree
zpe.thermalcorrener: 0.255240 hartree
zpe.thermalcorrenthalpy: 0.256185 hartree
zpe.thermalcorrgfe: 0.199528 hartree
zpe.sumelectzpe: -728.272540 hartree
zpe.sumelectthermal: -728.258341 hartree
zpe.sumelectthermalent: -728.257397 hartree
zpe.sumelectthermalfe: -728.314054 hartree
dipole: -0.6310 1.8051 0.1142
dipole: 1.9156
quadrupole: -97.1805 -92.5163 -88.8868
quadrupole: 12.6495 5.9318 -4.6960
quadrupole: -4.3193 0.3449 3.9744 12.6495 5.9318 -4.6960
hfenergy: -728.5135812 hartree
pointgroup: C01 [X(C13H14O3)]
dipole: 0.2121223 0.7224068 -0.0333999 debye
polarizability: 186.4759561|4.222142|155.6956491|9.3617917|7.0435099|111.0348766 unknown
InChI: InChI=1S/C13H14O3/c14-12(15)8-10-6-3-5-9-4-1-2-7-11(9)13(10)16/h1-2,4,7-8,13-14,16H,3,5-6H2
charge 0 multiplicity 1
30 atoms
O  0.380884 0.803669 -2.388901
O  -3.649416 0.172883 1.129719
O  -3.944074 -2.064417 0.610052
C  -0.303256 2.057249 0.884343
C  1.155091 2.081611 0.352463
C  -1.357083 1.538786 -0.139878
C  0.106609 -0.228846 -1.363062
C  1.837182 0.719948 0.312593
C  1.350938 -0.356826 -0.487324
C  -1.160428 0.096298 -0.549749
C  2.999469 0.502949 1.093683
C  2.026562 -1.600477 -0.475585
C  -2.000646 -0.956385 -0.287222
C  3.669126 -0.741309 1.10419
C  3.179323 -1.803307 0.314111
C  -3.250043 -1.020491 0.490895
H  -0.35949 1.458241 1.813199
H  -0.59722 3.091793 1.148785
H  1.752641 2.753781 0.996363
H  1.148614 2.519963 -0.66377
H  -1.259557 2.16535 -1.049537
H  -2.364694 1.677612 0.276287
H  -0.052009 -1.205417 -1.865466
H  3.382763 1.32749 1.707151
H  1.650204 -2.419705 -1.100667
H  -1.745015 -1.946273 -0.687981
H  4.563685 -0.877995 1.722052
H  3.688502 -2.773019 0.306858
H  -0.367032 0.805149 -3.041149
H  -4.497131 -0.017506 1.616649
