program: Gaussian 09
title: 000131412
version: EM64L-G09RevD.01
frameworkgroup: C1[X(C2H4ClO4P)]
method: RPBEPBE
basis: SDD
operation: Freq
keyword: #p
keyword: freq=noraman
keyword: PBEPBE/SDD
title: #p freq=noraman PBEPBE/SDD
converged: NO YES NO NO
title: Mulliken charges:
elementType: Cl P O O O O C C H H H H
charge: -0.004996 1.176794 -0.690135 -0.663661 -0.574648 -0.086161 0.008950 -0.597887 0.309502 0.316122 0.405928 0.400190
chargesum: 0.00000
title: Mulliken charges with hydrogens summed into heavy atoms:
elementType: Cl P O O O O C C
charge: -0.004996 1.176794 -0.284207 -0.263470 -0.574648 -0.086161 0.008950 0.027737
polarizability: 9.70256925e+01 -2.02981210e+00 6.30430383e+01 2.49566260e+00 8.55488224e-01 4.86352958e+01
1716.lowfreq: -26.2076 -12.2456 -7.4868 -6.0232 -0.0026 -0.0022 0.0022 61.7087 119.0243
frequency: -26.0665 61.7012 119.0225 124.4085 188.0533 204.2458 210.9855 259.0660 306.0128 344.4707 368.2196 418.5796 473.0970 638.4502 686.9379 712.0426 741.6731 858.7162 945.9897 984.2739 1008.7779 1059.8431 1138.4593 1263.0490 1387.6352 1690.1141 3045.2469 3111.6572 3582.2086 3594.8909
redmass: 6.9822 3.6508 6.6494 7.5636 2.6042 12.1032 4.3778 2.7585 1.7387 4.4176 2.1825 9.0969 2.7979 12.6458 9.1254 9.3887 7.0206 1.9154 2.6089 1.6513 1.4074 3.8274 1.0921 1.2819 1.0917 10.8038 1.0582 1.1040 1.0663 1.0663
irintensity: 3.6293 8.7480 10.2968 0.8938 51.9161 9.2876 19.2817 43.0967 33.9554 87.6033 125.4836 31.9474 0.6416 161.2043 88.0030 188.9637 28.6832 1.4890 50.1761 6.3654 35.9523 140.2085 7.7574 7.0649 52.0532 135.2528 11.3497 0.4569 79.7165 58.1350
temp: 298.150 k
press: 1.00000 atm
elementType: 17 15 8 8 8 8 6 6 1 1 1 1
symmnumber: 1
zpe: 176615.6 jmol-1
zpe.correction: 0.067269 hartree
zpe.thermalcorrener: 0.076830 hartree
zpe.thermalcorrenthalpy: 0.077774 hartree
zpe.thermalcorrgfe: 0.031782 hartree
zpe.sumelectzpe: -1180.126339 hartree
zpe.sumelectthermal: -1180.116779 hartree
zpe.sumelectthermalent: -1180.115835 hartree
zpe.sumelectthermalfe: -1180.161827 hartree
dipole: -1.5355 2.7678 1.4975
dipole: 3.5015
quadrupole: -62.6175 -58.5830 -64.8827
quadrupole: -0.5172 -6.9057 -3.7803
quadrupole: -0.5898 3.4447 -2.8549 -0.5172 -6.9057 -3.7803
hfenergy: -1180.1936087 hartree
pointgroup: C01 [X(C2H4Cl1O4P1)]
dipole: 0.6022312 0.6399184 -1.0609586 debye
dipolederiv: -0.6354952 0.0102106 -0.0216919 -0.0795668 -0.1096988 -0.0071842 0.0346813 -0.0048865 -0.1106414 1.3738504 -0.1767375 -0.0424546 -0.1475698 1.6931594 -0.0098937 -0.2777442 0.0102223 1.5907787 -0.5192638 -0.0096599 -0.002688 -0.1614969 -1.0171161 0.233069 0.0982437 0.2755905 -0.8392122 -0.8298028 0.0881169 0.2346534 0.2152337 -0.8084947 -0.2830997 0.3408075 -0.3125758 -0.6481837 -0.7946814 -0.0311806 -0.0734614 -0.008221 -0.5687369 -0.0198472 -0.0096223 -0.0252951 -0.6571417 -0.5099353 -0.1214178 0.0607506 -0.2867234 -0.6748329 0.2872282 0.180783 0.2852604 -0.3241357 0.9482805 0.1127465 -0.011163 0.3294451 0.6992307 -0.4337108 -0.2644947 -0.4346952 0.1744795 0.5621865 0.1683314 -0.0872509 0.2468233 -0.1173101 0.1771817 -0.1040016 0.1759757 0.0457561 -0.0252797 -0.0566233 -0.0270352 -0.0464685 0.075956 -0.0424159 -0.0117826 -0.0599647 0.1057237 -0.0149577 -0.0073411 0.0562658 -0.0268734 0.1418982 -0.0203872 0.0438936 -0.006729 0.0553293 0.1381981 -0.0170389 0.0089078 -0.0583043 0.3666704 0.0375361 0.0291526 0.0501455 0.3839795 0.3069004 0.0405935 -0.0948326 0.023722 0.3192747 0.0815237 -0.0599162 0.0469519 0.223268 unknown
polarizability: 96.9619555|3.3763982|58.5814132|1.3163405|-6.7170814|53.1606579 unknown
InChI: InChI=1S/C2H4ClO4P/c3-1-2(4)8(5,6)7/h5-6H,1H2
charge 0 multiplicity 1
12 atoms
Cl -3.303448 0.12862 0.099789
P  1.332011 0.169204 0.28672
O  1.081734 1.579715 -0.684165
O  1.944617 -0.933226 -0.912189
O  2.254456 0.294796 1.57802
O  -0.81162 -1.406941 1.058236
C  -0.559392 -0.350351 0.470693
C  -1.530297 0.63479 -0.137944
H  -1.393551 1.631713 0.312697
H  -1.340286 0.726165 -1.220322
H  1.894267 2.047657 -1.003424
H  2.589808 -1.597641 -0.556211
