program: Gaussian 09
title: 000131409
version: EM64L-G09RevD.01
frameworkgroup: C1[X(C8H11NO8)]
method: RPBEPBE
basis: SDD
operation: Freq
keyword: #p
keyword: freq=noraman
keyword: PBEPBE/SDD
title: #p freq=noraman PBEPBE/SDD
converged: YES YES NO NO
title: Mulliken charges:
elementType: O O O O O O O O N C C C C C C C C H H H H H H H H H H H
charge: -0.418518 -0.419144 -0.231972 -0.234249 -0.409868 -0.409543 -0.228680 -0.232942 -0.392006 -0.110430 -0.129631 -0.582469 -0.541037 0.231348 0.194453 0.204283 0.198182 0.303037 0.302781 0.288267 0.265788 0.280790 0.282548 0.265323 0.380554 0.379807 0.382847 0.380481
chargesum: 0.00000
title: Mulliken charges with hydrogens summed into heavy atoms:
elementType: O O O O O O O O N C C C C C C C C
charge: -0.037965 -0.039337 -0.231972 -0.234249 -0.027021 -0.029062 -0.228680 -0.232942 -0.103739 0.192608 0.173151 -0.035891 0.006833 0.231348 0.194453 0.204283 0.198182
polarizability: 1.45302123e+02 -2.23697702e+00 1.05711282e+02 2.77449727e-01 3.24262157e-01 1.05329283e+02
1716.lowfreq: -8.6559 -5.9453 0.0008 0.0010 0.0011 3.0213 19.0704 27.2042 33.3412
frequency: 19.0128 27.1820 33.3313 37.0565 48.3518 64.3255 70.9258 78.1071 84.3218 128.0962 135.8614 200.1247 233.2625 240.1187 268.4603 297.4586 332.7453 346.9421 390.4704 411.2071 486.0033 488.8231 513.6463 521.5873 565.0975 572.0722 600.2997 607.1693 629.0998 633.4291 640.8564 648.6182 698.1818 719.6727 785.0247 792.7583 862.4411 883.6529 986.8298 988.6042 1023.1438 1037.0458 1042.6603 1049.7613 1074.7869 1106.9482 1143.8072 1152.1714 1190.1812 1203.5085 1239.0958 1245.3111 1253.0652 1265.0261 1288.1393 1327.9578 1344.8218 1360.6347 1372.1246 1386.6915 1423.9259 1427.5008 1457.4381 1653.0751 1664.5173 1667.6289 1669.9473 3006.8246 3014.9154 3017.9951 3068.1465 3069.0061 3082.0148 3501.2628 3509.7658 3515.5780 3517.3543 3517.6801
redmass: 8.1207 7.7514 10.5053 10.5196 5.2438 12.4586 9.2090 6.2169 6.7204 5.4442 5.1516 7.2963 3.1400 3.3253 2.5187 4.2783 6.9226 4.9101 3.6133 2.8080 2.1117 1.9606 3.0885 2.9748 2.9574 4.1038 1.4173 2.9758 1.5241 1.5508 1.5205 2.6767 3.7943 4.9918 3.6490 3.9933 5.0582 3.9775 2.4466 2.4856 4.0269 2.6284 2.6903 2.4400 3.4488 2.0801 1.9327 2.7943 1.2783 1.3957 1.3312 1.5132 1.5819 1.6590 1.5442 1.4139 1.8477 1.7566 2.0114 1.7815 1.0906 1.0952 1.2912 8.2776 8.4151 8.4286 8.7510 1.0612 1.0612 1.0839 1.0930 1.0967 1.0948 1.0640 1.0640 1.0640 1.0646 1.0759
irintensity: 0.2424 0.5423 1.9942 1.1695 0.3073 0.8878 0.3697 0.6152 0.7631 5.0354 0.5478 0.5199 4.5302 2.5999 31.7856 6.6907 1.8326 17.4748 28.8169 36.4540 23.4450 17.2325 99.2852 56.4558 150.6195 4.3739 49.9546 87.5979 92.8416 31.1957 201.6791 15.9367 46.7290 25.7374 6.7462 1.2950 2.8239 0.2301 23.8844 4.6969 76.0035 33.2381 379.0441 542.6298 105.2688 6.2790 2.7960 28.9050 8.7020 5.6848 29.8661 4.3208 3.2991 1.2988 44.4063 1.3399 23.1605 40.0118 141.3349 0.0837 25.6215 49.5906 3.1696 246.1128 146.1622 353.8618 128.9264 7.5327 6.0790 3.3629 0.2357 1.9783 1.9646 22.1281 24.3817 27.6086 27.1979 8.3529
temp: 298.150 k
press: 1.00000 atm
elementType: 8 8 8 8 8 8 8 8 7 6 6 6 6 6 6 6 6 1 1 1 1 1 1 1 1 1 1 1
symmnumber: 1
zpe: 526133.7 jmol-1
zpe.correction: 0.200394 hartree
zpe.thermalcorrener: 0.218987 hartree
zpe.thermalcorrenthalpy: 0.219931 hartree
zpe.thermalcorrgfe: 0.149477 hartree
zpe.sumelectzpe: -966.704473 hartree
zpe.sumelectthermal: -966.685880 hartree
zpe.sumelectthermalent: -966.684936 hartree
zpe.sumelectthermalfe: -966.755390 hartree
dipole: -0.0885 -0.5003 -1.0617
dipole: 1.1770
quadrupole: -91.7086 -92.5206 -103.5493
quadrupole: 14.7802 -0.0261 0.8974
quadrupole: 4.2176 3.4056 -7.6231 14.7802 -0.0261 0.8974
hfenergy: -966.9048672 hartree
pointgroup: C01 [X(C8H11N1O8)]
dipole: 0.0442802 -0.1965554 0.4169473 debye
polarizability: 144.9688716|4.2476885|106.0461744|0.3665345|-0.3007368|105.327642 unknown
InChI: InChI=1S/C8H11NO8/c10-5(11)1-3(7(14)15)9-4(8(16)17)2-6(12)13/h3-4,9-10,12,14,16H,1-2H2
charge 0 multiplicity 1
28 atoms
O  0.675412 2.164172 -1.199503
O  -0.626713 -2.007836 -1.341349
O  2.271964 2.443653 0.466832
O  -2.024693 -2.506437 0.449567
O  4.757551 -0.880772 0.894796
O  -4.856851 0.688374 0.877892
O  3.859056 -0.068465 -1.087681
O  -3.8932 -0.068018 -1.095273
N  -0.025209 0.089389 0.818129
C  1.248275 0.199629 0.077424
C  -1.27499 -0.154587 0.078112
C  2.40664 -0.401968 0.88854
C  -2.481511 0.331656 0.896672
C  1.501657 1.697817 -0.172866
C  -1.40623 -1.658423 -0.231783
C  3.705081 -0.408641 0.104575
C  -3.769398 0.276787 0.100438
H  1.17957 -0.307392 -0.903444
H  -1.223584 0.392435 -0.877026
H  0.03166 -0.337106 1.746937
H  2.170862 -1.445214 1.172218
H  2.571986 0.168377 1.821199
H  -2.30211 1.371937 1.221983
H  -2.615658 -0.279071 1.808981
H  0.810994 3.143114 -1.321052
H  -0.687521 -2.989593 -1.499688
H  5.599321 -0.873597 0.362938
H  -5.688661 0.641683 0.332335
