program: Gaussian 09
title: 000131396
version: EM64L-G09RevD.01
frameworkgroup: C1[X(C22H30FN3OS2)]
method: RPBEPBE
basis: SDD
operation: Freq
keyword: #p
keyword: freq=noraman
keyword: PBEPBE/SDD
title: #p freq=noraman PBEPBE/SDD
converged: YES YES NO NO
title: Mulliken charges:
elementType: S S F O N N N C C C C C C C C C C C C C C C C C C C C C C H H H H H H H H H H H H H H H H H H H H H H H H H H H H H H
charge: 0.187509 0.247176 -0.207189 -0.263425 -0.072705 -0.118302 -0.164687 -0.356491 -0.366853 -0.363962 -0.255639 -0.383788 -0.378737 -0.420528 -0.412900 -0.422170 -0.358520 0.275671 0.479735 -0.660626 -0.641287 -0.604525 0.439649 -0.734553 -0.351301 -0.329580 -0.440894 -0.403969 0.339832 0.183923 0.206918 0.183926 0.210957 0.207273 0.191258 0.207779 0.209316 0.254473 0.207002 0.268688 0.227479 0.221814 0.197003 0.227527 0.190792 0.229371 0.221877 0.234843 0.241600 0.237085 0.224177 0.230067 0.235900 0.209918 0.234839 0.269365 0.252123 0.271189 0.254577
chargesum: 0.00000
title: Mulliken charges with hydrogens summed into heavy atoms:
elementType: S S F O N N N C C C C C C C C C C C C C C C C C C C C C C
charge: 0.187509 0.247176 -0.207189 -0.263425 -0.072705 -0.118302 -0.164687 0.034350 0.028029 0.034569 -0.255639 0.033307 0.082738 0.028765 0.011630 -0.153483 0.061643 0.275671 0.479735 0.037695 0.050042 0.076132 0.439649 -0.465188 -0.351301 -0.077456 -0.169705 -0.149392 0.339832
polarizability: 3.90730783e+02 -8.06267451e-01 2.82498829e+02 1.56966061e+00 -6.81201900e+00 2.20094811e+02
1716.lowfreq: -5.3112 0.0009 0.0011 0.0018 0.8176 3.7016 10.4927 17.1185 21.0127
frequency: 10.3961 14.2769 19.6169 28.6368 43.1177 45.2775 58.4816 60.2719 68.3015 75.7407 94.4660 106.1979 139.8602 158.3584 162.4530 181.0170 200.0607 216.5596 221.6877 233.0304 238.0384 245.4339 256.6965 266.0361 276.7309 299.3292 301.2933 301.5751 313.0638 324.6612 328.8263 339.0288 348.6011 372.1878 388.3953 406.4655 419.4561 428.4960 434.8282 455.3258 473.3148 488.9642 499.5290 530.0998 539.8784 555.5922 584.1876 618.0267 619.5759 636.7106 666.6058 675.7975 713.4502 713.4593 727.5375 737.3938 738.7632 743.8904 763.6611 781.5804 785.4262 811.4368 839.5110 845.9524 853.1985 879.1244 893.5556 913.6988 940.5378 942.2946 945.1398 960.0479 990.2773 1003.9775 1004.3818 1015.7167 1026.3425 1039.3094 1050.4229 1051.2788 1057.9369 1079.4150 1087.5803 1088.7703 1105.0085 1114.8597 1127.7438 1132.7286 1134.9270 1142.8759 1154.7801 1164.0502 1180.5889 1183.4816 1185.6172 1192.9408 1206.2027 1226.6860 1230.1999 1247.2774 1249.2245 1267.3374 1271.9486 1284.9291 1294.3432 1302.4249 1306.3209 1321.3811 1332.7462 1336.9199 1347.8526 1361.7385 1368.3801 1369.7258 1373.7355 1374.0614 1386.9446 1388.2590 1389.2731 1396.2806 1406.9233 1414.3722 1449.0079 1451.2558 1453.8926 1457.7881 1458.2599 1460.7073 1461.9866 1464.3346 1465.7727 1467.2595 1470.1964 1470.5464 1473.3936 1480.5402 1486.8277 1531.9678 1578.1896 1601.4605 1606.3401 2839.3881 2851.7003 2864.7689 2897.1956 2918.4640 2973.7122 2980.7468 2981.4684 2985.1154 2990.7992 3000.8517 3002.5799 3013.4727 3025.9260 3030.7152 3047.4876 3049.2346 3053.4144 3071.6238 3076.8616 3077.2850 3085.3460 3091.1770 3096.4704 3103.3666 3104.8652 3150.8837 3175.1762 3179.6942 3234.9715
redmass: 5.6246 5.5088 5.6850 4.4742 4.7098 4.4962 3.5439 4.1125 5.7786 5.2220 1.8046 3.1266 5.4725 3.6346 4.5024 4.5897 1.0828 2.7790 3.6816 3.2878 1.2701 1.4316 1.8788 2.0675 2.3692 4.1826 4.1704 3.1986 3.5509 3.4355 3.8859 3.4026 3.6608 3.4831 2.3546 7.2186 4.0408 7.1127 3.0084 4.4974 3.2933 5.7655 4.2012 5.8905 5.0729 4.7162 4.3879 3.5084 2.9464 2.4330 6.3660 3.4005 7.1265 3.9034 1.6042 4.2867 2.0165 1.3108 4.0287 2.3646 1.6093 1.4941 5.7755 1.5570 1.4569 2.3438 4.2372 1.7370 1.3624 1.4771 2.0190 1.9415 2.9443 1.3867 1.6223 2.8007 2.4671 2.1390 2.9510 2.1285 2.2111 2.6965 2.0719 2.3458 2.0114 1.7610 2.0370 1.7145 1.7289 2.6322 2.4058 3.5785 2.6913 1.8201 1.8307 1.4033 1.8123 1.9902 1.8763 1.3679 1.3989 1.4421 1.4091 1.3066 1.2414 1.2950 1.3662 1.3402 1.3260 1.2792 1.4814 3.2283 1.3751 1.5246 1.4605 1.1883 3.7046 1.2167 1.3078 1.4631 2.0616 5.5242 1.1056 1.0833 1.0485 1.0488 1.0823 1.1267 1.0533 2.2063 1.0789 1.0661 1.2919 1.0666 1.1026 1.0585 1.0995 6.5912 8.4608 8.5009 7.2230 1.0705 1.0713 1.0695 1.0689 1.0705 1.0605 1.0375 1.0599 1.0346 1.0349 1.0605 1.0863 1.0854 1.0974 1.0892 1.0963 1.0961 1.0899 1.1047 1.0974 1.0900 1.1001 1.1001 1.1007 1.1004 1.1008 1.0889 1.0933 1.0963 1.0949
irintensity: 0.1981 0.5503 0.4539 0.2913 2.4244 1.4151 0.3220 0.0194 0.2007 0.8297 0.1712 0.0566 0.0256 2.8734 0.3692 0.3796 0.4599 0.6295 2.7847 3.7654 2.0262 0.6309 1.4989 1.8175 1.2949 5.1282 1.2101 1.6671 4.7186 6.7000 2.6426 2.9964 2.8148 4.0544 1.4880 4.7953 9.0230 4.2195 7.5732 2.9801 0.1383 6.5945 12.8448 2.8701 5.3378 4.0145 3.8256 0.9540 1.5225 3.3303 2.2995 1.2808 3.0350 8.4922 43.4178 0.7298 0.1103 11.1879 7.8168 15.4434 8.5096 37.2243 66.5110 0.9936 39.9202 2.7062 21.3931 3.1454 0.3808 1.1216 1.4029 5.5811 28.5582 4.7711 18.5726 35.9064 18.8255 6.3658 0.6617 5.3684 0.6412 0.5416 0.9663 8.8381 17.6913 12.1659 36.5221 16.3725 43.2934 55.0057 16.5657 6.0183 10.0426 69.8405 24.9498 12.4279 32.4860 8.1708 14.8898 21.7206 5.0424 46.4561 1.8588 33.3327 35.7153 3.4377 38.9947 20.7201 15.9422 2.9002 21.0866 24.7644 4.2763 9.1739 31.0229 15.9723 83.3373 30.1270 1.7517 5.8267 95.9826 9.6260 10.9338 6.7241 10.5396 1.5606 8.1744 15.9149 8.0598 38.9966 18.8465 5.4113 33.4680 8.9776 2.4198 28.6037 17.2583 48.4517 49.4285 193.5292 63.8077 49.9713 59.5153 111.2626 68.6522 86.0685 3.2515 22.4539 26.9346 20.7132 22.4488 39.3582 23.1680 20.5241 2.3045 45.7289 55.6454 1.0021 48.0050 36.7986 31.2978 19.7275 7.9753 19.2266 21.3097 29.2892 19.1928 5.5221 0.8083 4.6437 7.5280
temp: 298.150 k
press: 1.00000 atm
elementType: 16 16 9 8 7 7 7 6 6 6 6 6 6 6 6 6 6 6 6 6 6 6 6 6 6 6 6 6 6 1 1 1 1 1 1 1 1 1 1 1 1 1 1 1 1 1 1 1 1 1 1 1 1 1 1 1 1 1 1
symmnumber: 1
zpe: 1269927.0 jmol-1
zpe.correction: 0.483690 hartree
zpe.thermalcorrener: 0.513404 hartree
zpe.thermalcorrenthalpy: 0.514348 hartree
zpe.thermalcorrgfe: 0.419291 hartree
zpe.sumelectzpe: -1989.583123 hartree
zpe.sumelectthermal: -1989.553409 hartree
zpe.sumelectthermalent: -1989.552465 hartree
zpe.sumelectthermalfe: -1989.647522 hartree
dipole: -3.3350 -1.2735 -2.6120
dipole: 4.4234
quadrupole: -228.1189 -184.2398 -194.2549
quadrupole: -1.3881 7.5837 0.3486
quadrupole: -25.9143 17.9647 7.9496 -1.3881 7.5837 0.3486
hfenergy: -1990.0668129 hartree
pointgroup: C01 [X(C22H30F1N3O1S2)]
dipole: -1.3172157 0.7773543 0.8302428 debye
polarizability: 390.6266217|2.2022083|272.1151443|-3.1742998|-24.3194473|230.5826566 unknown
InChI: InChI=1S/C22H30FN3OS2/c1-16-26(21(27)22(2,3)29-16)9-5-4-8-24-10-12-25(13-11-24)19-15-28-20-14-17(23)6-7-18(19)20/h6-7,14-16H,4-5,8-13H2,1-3H3
charge 0 multiplicity 1
59 atoms
S  -8.13489 -0.685748 1.36417
S  6.782249 2.116094 -1.23522
F  9.166931 -2.170774 0.735649
O  -5.967038 -0.609931 -1.985276
N  0.370856 0.43034 0.547741
N  -5.985194 0.39234 0.129583
N  3.177258 0.558442 -0.16968
C  -0.97319 -0.185656 0.688893
C  1.399475 -0.302122 1.329676
C  0.805644 0.557736 -0.866494
C  -7.898039 -1.023807 -0.512308
C  -2.119479 0.730437 0.213113
C  -4.648197 0.992585 -0.066047
C  2.750226 0.424877 1.251914
C  2.158787 1.282657 -0.961496
C  -6.70763 0.590037 1.39618
C  -3.504795 0.090266 0.45359
C  -6.526165 -0.406789 -0.865114
C  4.537201 0.893563 -0.403607
C  -7.872441 -2.545373 -0.761691
C  -9.005823 -0.332629 -1.341161
C  -7.242378 2.019745 1.581777
C  5.638546 -0.005687 -0.039328
C  4.982844 2.042213 -1.040142
C  6.921115 0.522652 -0.385473
C  5.57054 -1.30545 0.532149
C  8.119115 -0.178372 -0.137336
C  6.749169 -2.027208 0.791822
C  7.991506 -1.438864 0.463017
H  -1.035681 -1.165346 0.146342
H  -1.122924 -0.406605 1.764325
H  1.531273 -1.351189 0.958472
H  1.072144 -0.349759 2.385117
H  0.054548 1.140376 -1.427926
H  0.898736 -0.446663 -1.353222
H  -2.014363 0.948483 -0.86798
H  -2.039359 1.697592 0.747243
H  -4.524924 1.149077 -1.153485
H  -4.619106 1.979517 0.432469
H  -6.059394 0.301991 2.244234
H  3.515215 -0.129491 1.819368
H  2.645514 1.432577 1.716316
H  2.030648 2.331084 -0.599912
H  2.489206 1.314129 -2.01523
H  -3.642916 -0.109624 1.535674
H  -3.56537 -0.88378 -0.068618
H  -8.851744 -2.994725 -0.519033
H  -7.098967 -3.039003 -0.15005
H  -7.648851 -2.729865 -1.827856
H  -8.810825 -0.491796 -2.417926
H  -9.0392 0.752923 -1.145453
H  -9.992849 -0.75892 -1.09115
H  -7.811244 2.090285 2.525206
H  -6.415302 2.754358 1.626656
H  -7.914789 2.291592 0.750453
H  4.397808 2.880967 -1.411105
H  4.595469 -1.757348 0.737739
H  9.104471 0.216106 -0.398731
H  6.725974 -3.030215 1.226564
