program: Gaussian 09
title: 000131394
version: EM64L-G09RevD.01
frameworkgroup: C1[X(C13H24O12S)]
method: RPBEPBE
basis: SDD
operation: Freq
keyword: #p
keyword: freq=noraman
keyword: PBEPBE/SDD
title: #p freq=noraman PBEPBE/SDD
converged: YES YES NO NO
title: Mulliken charges:
elementType: S O O O O O O O O O O O O C C C C C C C C C C C C C H H H H H H H H H H H H H H H H H H H H H H H H
charge: 1.198279 -0.280101 -0.219119 -0.266126 -0.383418 -0.440479 -0.480786 -0.426461 -0.479557 -0.425052 -0.358399 -0.455216 -0.556177 -0.091323 -0.144555 -0.067166 -0.025233 -0.192051 -0.070993 -0.074224 -0.168260 -0.121801 -0.054560 -0.684875 -0.704337 -0.485973 0.276498 0.256840 0.319458 0.204317 0.255053 0.239162 0.189656 0.271532 0.246331 0.202248 0.234908 0.223417 0.238595 0.213586 0.241789 0.228910 0.376342 0.396214 0.357238 0.380751 0.342669 0.260009 0.256359 0.246082
chargesum: 0.00000
title: Mulliken charges with hydrogens summed into heavy atoms:
elementType: S O O O O O O O O O O O O C C C C C C C C C C C C C
charge: 1.198279 -0.280101 -0.219119 -0.266126 -0.383418 -0.064138 -0.084573 -0.069223 -0.098806 -0.082383 -0.358399 -0.455216 -0.556177 0.185175 0.112285 0.252292 0.179083 0.063002 0.168169 0.115431 0.103272 0.124530 0.147688 0.012045 -0.020051 0.276478
polarizability: 2.94653676e+02 2.21296400e+01 2.33759108e+02 6.42196595e+00 -2.73239778e+00 1.68270263e+02
1716.lowfreq: -8.5518 -0.0014 -0.0008 -0.0006 4.0026 6.6502 15.8448 23.1462 33.1639
frequency: 15.4191 23.0220 31.7216 42.6547 46.3048 49.9758 64.4738 86.0760 91.1329 110.0617 118.8348 131.2651 140.4028 150.2107 162.1005 168.1969 179.8189 187.7512 192.5083 198.5071 219.2409 221.6154 240.2257 248.3593 255.1774 261.6588 283.2528 288.0926 303.4754 338.7744 343.5370 350.7024 368.7865 378.0507 387.8749 407.3935 413.3944 418.7100 426.5150 433.8338 452.5804 461.1738 468.6894 496.4225 520.4296 553.5498 555.8595 585.0009 599.7686 624.4216 627.3107 646.4020 692.9887 718.0762 753.4401 782.0119 804.6085 826.5966 849.2763 851.7380 858.9548 894.6178 902.4259 909.7623 943.8238 947.8090 952.3325 965.1063 986.5557 994.2399 997.1846 1005.7001 1017.7528 1028.1552 1050.2578 1057.0222 1067.4828 1076.6322 1086.9434 1099.7222 1102.7055 1103.6778 1111.3742 1111.8499 1155.8762 1163.5390 1173.8503 1191.7579 1204.7853 1233.7766 1236.8787 1246.7806 1259.0579 1267.0816 1276.2701 1288.5077 1302.0950 1313.9877 1321.3788 1330.8758 1339.2950 1345.4219 1353.6833 1362.7317 1366.2310 1371.1189 1373.3721 1378.8428 1387.0854 1389.4235 1392.3267 1394.6137 1404.2300 1424.2997 1430.3829 1461.6645 1462.7474 1470.9396 1472.4060 1473.8356 2909.8177 2923.9820 2953.9250 2986.0794 2990.1507 2998.8829 3002.5182 3003.1514 3034.1474 3044.4290 3046.4349 3067.9414 3069.2808 3090.3338 3095.5346 3101.9877 3109.8311 3110.5881 3139.9896 3357.7167 3400.5655 3497.8748 3525.8696 3572.6968
redmass: 5.0335 7.3675 5.4271 5.9500 3.7345 5.1524 5.4018 5.5872 1.2501 7.0675 6.3385 4.6964 4.5155 3.9750 1.1094 4.3398 5.6969 1.9624 2.1692 5.8208 2.9079 5.0772 8.5502 6.2056 4.4788 4.4758 3.8352 7.8185 7.5270 3.0999 6.4882 4.0375 4.8166 1.9566 3.6599 2.6202 3.9957 5.2595 4.0644 1.5001 1.1495 5.2428 6.7028 7.9517 4.3721 10.6272 4.9882 4.6216 3.9452 1.1988 1.1678 3.0152 3.9678 3.8902 3.5268 3.8363 3.8410 2.9994 3.4868 10.4310 3.3454 5.0763 8.7960 2.8774 5.5771 5.0104 3.2849 4.1153 2.1961 11.7040 2.7085 3.6478 4.4556 3.8523 3.1443 2.1465 2.1167 2.1958 3.0613 3.1591 1.3431 2.2234 1.4967 1.5923 2.3042 1.5182 1.1413 1.8914 1.3916 1.4209 1.2681 1.2787 1.3064 1.3117 1.1755 1.3065 1.3097 1.1909 1.2703 1.2909 1.3269 1.4823 1.3013 1.2856 1.3783 1.2570 1.3167 1.4624 1.2539 1.3832 1.3768 1.3445 1.1147 1.1680 1.0502 1.0519 1.0442 1.0550 1.0528 1.0500 1.0818 1.0837 1.0839 1.0272 1.0809 1.0364 1.0848 1.0384 1.0859 1.0863 1.0871 1.0869 1.0894 1.0988 1.0986 1.1066 1.1006 1.1037 1.0970 1.0669 1.0691 1.0649 1.0650 1.0660
irintensity: 1.6681 1.4718 0.8146 1.6841 3.1084 1.8161 1.0304 0.8472 0.3315 3.4671 2.2182 1.2554 3.6806 0.9517 1.6585 5.0985 2.0508 2.2594 0.5288 0.2095 6.9448 2.4175 2.4314 2.4067 13.1311 15.0710 1.7813 5.9787 5.9512 49.2584 12.0050 24.5788 15.6566 60.6606 11.4590 78.6842 8.6498 23.0540 7.9832 78.6277 176.2872 4.6747 20.3187 64.4701 15.1112 117.7545 4.8527 7.2807 23.1192 99.4789 207.9166 74.6239 13.3867 2.4028 9.0667 12.8273 41.9927 14.2468 12.7699 88.8905 59.7344 86.5491 59.6735 48.5121 195.7067 223.8687 28.4373 21.0347 28.4131 74.3382 55.4703 4.6119 48.3491 147.0625 248.7305 8.6640 44.3599 14.8125 13.9092 31.9776 16.6102 67.2073 12.8978 17.2906 6.3071 21.8021 43.9954 23.8768 18.7137 5.7954 37.9594 24.0748 11.5753 18.2623 32.5945 7.5231 23.6992 19.2375 3.3951 29.9031 11.0098 4.4614 3.4029 44.5793 11.4577 14.9299 2.8493 16.3428 25.1599 4.4078 22.5244 21.2356 3.3209 60.3031 19.0509 9.5413 13.8142 17.4198 21.0971 7.3776 23.0089 36.6073 60.6998 22.5101 2.8009 21.7112 25.2290 15.1555 22.7936 14.2699 11.0101 23.3964 21.0709 20.9507 25.5263 17.4584 16.5292 10.1189 12.9753 143.7587 161.4525 4.6644 12.5692 17.2442
temp: 298.150 k
press: 1.00000 atm
elementType: 16 8 8 8 8 8 8 8 8 8 8 8 8 6 6 6 6 6 6 6 6 6 6 6 6 6 1 1 1 1 1 1 1 1 1 1 1 1 1 1 1 1 1 1 1 1 1 1 1 1
symmnumber: 1
zpe: 1010703.5 jmol-1
zpe.correction: 0.384957 hartree
zpe.thermalcorrener: 0.414353 hartree
zpe.thermalcorrenthalpy: 0.415298 hartree
zpe.thermalcorrgfe: 0.323820 hartree
zpe.sumelectzpe: -1808.168084 hartree
zpe.sumelectthermal: -1808.138687 hartree
zpe.sumelectthermalent: -1808.137743 hartree
zpe.sumelectthermalfe: -1808.229220 hartree
dipole: -3.8538 4.7060 -0.9111
dipole: 6.1504
quadrupole: -149.8171 -157.0889 -173.5974
quadrupole: 17.6006 30.9636 -3.8832
quadrupole: 10.3507 3.0789 -13.4296 17.6006 30.9636 -3.8832
hfenergy: -1808.5530406 hartree
pointgroup: C01 [X(C13H24O12S1)]
dipole: 1.6549951 1.7489591 0.2396344 debye
polarizability: 291.3044157|-26.0666264|237.4344178|5.3654165|-0.5959151|167.9442125 unknown
InChI: InChI=1S/C13H24O12S/c1-4-6(14)7(15)8(16)13(23-4)24-11-9(17)10(5(2)22-12(11)18)25-26(19,20)21-3/h4-18H,1-3H3
charge 0 multiplicity 1
50 atoms
S  2.979641 -2.222226 -0.47171
O  -0.724033 0.493594 -0.042996
O  1.299537 2.359212 1.146242
O  -3.014683 0.936531 -0.129166
O  3.292366 -0.372832 -0.485722
O  1.988832 1.730191 -2.306182
O  -1.319471 -2.373207 -0.796943
O  -3.867596 -3.199539 0.189132
O  0.872658 3.721796 -0.814584
O  -4.592901 -0.679476 1.606237
O  3.803644 -2.714555 1.104262
O  3.755796 -2.851274 -1.722655
O  1.418378 -2.496202 -0.184377
C  -0.005324 1.503395 -0.834494
C  1.290276 0.845103 -1.383579
C  2.089296 0.40475 -0.13463
C  -1.959551 0.014027 -0.597088
C  -2.171664 -1.425637 -0.0832
C  2.529011 1.564419 0.798816
C  -3.614032 -1.885071 -0.377177
C  0.353029 2.679281 0.100487
C  -4.645299 -0.865698 0.154819
C  -4.381397 0.489141 -0.559206
C  3.690606 2.439411 0.307058
C  -5.350145 1.602493 -0.171434
C  5.275243 -2.844891 0.983888
H  -0.629984 1.887027 -1.661516
H  1.023862 -0.054098 -1.968226
H  1.395756 -0.231018 0.452768
H  -1.934334 0.019062 -1.712405
H  -1.98055 -1.450962 1.009202
H  2.799376 1.12928 1.776653
H  -3.720181 -1.923793 -1.487986
H  -0.536245 3.038939 0.645269
H  -5.662864 -1.238414 -0.051875
H  -4.375984 0.342427 -1.661903
H  3.514812 2.865625 -0.690743
H  3.86829 3.251634 1.033312
H  4.603579 1.819954 0.246183
H  -6.364353 1.367733 -0.541477
H  -5.401066 1.706821 0.925152
H  -5.029464 2.562213 -0.610474
H  1.805871 2.673076 -2.021439
H  -0.372124 -2.347591 -0.481805
H  -3.10711 -3.776454 -0.08753
H  1.147627 4.512132 -0.284837
H  -3.808634 -0.09767 1.797862
H  5.553356 -3.502821 0.142343
H  5.556137 -3.317378 1.940227
H  5.756211 -1.856162 0.886848
