program: Gaussian 09
title: 000131393
version: EM64L-G09RevD.01
frameworkgroup: C1[X(C8H13BrN4O2)]
method: RPBEPBE
basis: SDD
operation: Freq
keyword: #p
keyword: freq=noraman
keyword: PBEPBE/SDD
title: #p freq=noraman PBEPBE/SDD
converged: YES YES NO NO
title: Mulliken charges:
elementType: Br O O N N N N C C C C C C C C H H H H H H H H H H H H H
charge: -0.048571 -0.162463 -0.240803 -0.125750 -0.303701 -0.026759 0.077598 -0.377447 -0.380859 -0.353903 -0.309421 0.179310 -0.144797 -0.652834 -0.292038 0.228108 0.232655 0.263358 0.211707 0.208679 0.197111 0.259891 0.233092 0.228577 0.270851 0.288665 0.272231 0.267515
chargesum: 0.00000
title: Mulliken charges with hydrogens summed into heavy atoms:
elementType: Br O O N N N N C C C C C C C C
charge: -0.048571 -0.162463 -0.240803 -0.125750 -0.043810 -0.026759 0.077598 0.083315 0.094205 0.051886 0.152248 0.179310 0.126054 -0.091938 -0.024522
polarizability: 2.04994620e+02 3.90788166e+00 1.40533048e+02 2.26989794e+01 5.21691882e-01 9.03450711e+01
1716.lowfreq: -7.3582 0.0004 0.0005 0.0006 2.9296 4.9523 16.2650 22.8705 35.2956
frequency: 15.9727 22.5507 35.2395 44.5627 52.4717 80.2480 106.2728 126.0875 156.9866 166.7039 205.5708 210.4714 249.3135 314.4104 349.7183 376.4771 430.4543 473.5332 531.2813 610.9228 624.2330 630.4516 666.0928 700.4021 721.3254 760.9423 763.7407 770.1329 774.3594 860.7038 863.4235 889.6298 961.6898 1004.2840 1038.9300 1049.5856 1064.0409 1080.1927 1086.9143 1108.5252 1137.7093 1145.6660 1153.8614 1203.5059 1223.5881 1231.0087 1252.1347 1266.2807 1288.8202 1292.7162 1300.6341 1336.5615 1340.6223 1357.9983 1360.5232 1370.7650 1390.3422 1415.2787 1446.5916 1449.9185 1464.2619 1469.9500 1480.6494 1483.7343 1495.1067 2871.6308 2928.2123 2996.5474 3001.8977 3024.2682 3047.3365 3059.2524 3064.4012 3103.5999 3151.3204 3228.2734 3253.5443 3451.8223
redmass: 6.6894 4.6091 2.8393 4.9952 7.9566 4.7844 2.1881 3.2035 4.2110 3.7727 5.5206 3.8746 6.0967 4.8140 3.3802 4.3537 8.6224 3.5667 5.6323 4.8732 6.3565 3.7888 1.3747 10.7024 4.7576 1.1571 4.4034 1.1720 1.3682 1.4320 1.4495 4.0544 1.6874 2.2019 3.0607 2.5621 2.4437 2.6493 1.5179 1.9417 2.3253 3.5474 2.5594 1.5273 1.2542 3.4597 1.5546 1.2060 1.2205 1.3600 2.0291 1.7464 2.1928 2.4406 3.7637 2.0420 1.4321 2.9105 1.1115 2.1567 1.2034 1.1258 1.2336 1.2278 1.0927 1.0705 1.0693 1.0828 1.0646 1.0634 1.0897 1.0598 1.1016 1.1026 1.1107 1.0926 1.1080 1.0745
irintensity: 1.7701 1.9955 3.3729 0.7866 2.2630 1.4271 3.0113 0.1804 4.6421 1.7277 1.2089 3.4598 1.4927 2.7664 0.9687 7.3578 0.2732 1.5914 5.7919 75.6049 28.2360 1.4647 90.1600 2.8311 25.2872 1.6277 25.2162 24.7158 39.2969 4.3660 5.9599 3.2260 7.8622 3.7280 11.0510 14.8152 9.1369 1.8384 7.3873 46.1202 57.7054 120.7407 34.8021 1.0164 25.3070 46.2668 1.2639 11.3974 6.5286 22.8832 102.4396 47.7814 72.4804 165.7130 76.8763 9.7499 10.1484 4.4528 10.3292 6.3830 26.6678 9.0817 8.4052 3.6450 11.1509 93.1485 65.3839 15.8368 16.5095 33.5901 13.2499 20.9908 16.9095 8.6416 10.5710 1.4512 1.2589 0.1401
temp: 298.150 k
press: 1.00000 atm
elementType: 35 8 8 7 7 7 7 6 6 6 6 6 6 6 6 1 1 1 1 1 1 1 1 1 1 1 1 1
symmnumber: 1
zpe: 571331.6 jmol-1
zpe.correction: 0.217609 hartree
zpe.thermalcorrener: 0.233461 hartree
zpe.thermalcorrenthalpy: 0.234405 hartree
zpe.thermalcorrgfe: 0.168919 hartree
zpe.sumelectzpe: -694.289048 hartree
zpe.sumelectthermal: -694.273196 hartree
zpe.sumelectthermalent: -694.272251 hartree
zpe.sumelectthermalfe: -694.337738 hartree
dipole: 0.9498 -4.8417 1.6714
dipole: 5.2094
quadrupole: -147.0069 -98.3506 -96.6798
quadrupole: 23.8065 -7.4641 -1.7286
quadrupole: -32.9945 15.6618 17.3326 23.8065 -7.4641 -1.7286
hfenergy: -694.5066562 hartree
pointgroup: C01 [X(C8H13Br1N4O2)]
dipole: 0.3585359 -1.9247597 0.6060533 debye
polarizability: 205.83554|2.5260458|140.4013246|20.7879639|1.3612944|89.6358745 unknown
InChI: InChI=1S/C8H13BrN4O2/c9-2-4-10-3-1-6-12-7-5-11-8(12)13(14)15/h5,7,10H,1-4,6H2
charge 0 multiplicity 1
28 atoms
Br 7.272548 -0.079926 -0.245591
O  -3.597629 2.326071 -0.368413
O  -1.497159 2.00326 0.481999
N  -1.865524 -0.807373 0.3556
N  3.004288 0.100236 -0.257109
N  -3.869647 -0.448518 -0.694893
N  -2.631803 1.566502 0.001642
C  0.585669 -0.356789 0.009849
C  -0.549697 -0.617827 1.021033
C  1.938247 -0.175259 0.728069
C  4.384752 0.166584 0.266515
C  -2.794519 0.13256 -0.118496
C  -2.404215 -2.050057 0.041714
C  5.343481 -0.16828 -0.885061
C  -3.633025 -1.811003 -0.600925
H  0.666258 -1.193194 -0.7088
H  0.345456 0.560421 -0.560263
H  -0.632894 0.227919 1.720883
H  -0.348314 -1.538489 1.598765
H  2.206289 -1.106992 1.265381
H  1.838769 0.627671 1.500444
H  2.773482 0.90518 -0.854348
H  4.494954 -0.593244 1.061193
H  4.655996 1.14867 0.715542
H  -1.890284 -2.97403 0.295566
H  5.192464 -1.191508 -1.256662
H  5.286606 0.556761 -1.712209
H  -4.34265 -2.535648 -0.991926
