program: Gaussian 09
title: 000131390
version: EM64L-G09RevD.01
frameworkgroup: C1[X(C12H12F2N2O2)]
method: RPBEPBE
basis: SDD
operation: Freq
keyword: #p
keyword: freq=noraman
keyword: PBEPBE/SDD
title: #p freq=noraman PBEPBE/SDD
converged: YES YES NO NO
title: Mulliken charges:
elementType: F F O O N N C C C C C C C C C C C C H H H H H H H H H H H H
charge: -0.208569 -0.206643 -0.399855 -0.249694 -0.411619 -0.576611 0.418992 0.112323 -0.598065 0.265714 -0.169359 -0.425627 -0.400563 -0.452488 0.474818 -0.462499 0.189514 -0.087903 0.213396 0.231201 0.256566 0.269511 0.313921 0.260893 0.263833 0.229765 0.272356 0.294869 0.200424 0.381400
chargesum: 0.00000
title: Mulliken charges with hydrogens summed into heavy atoms:
elementType: F F O O N N C C C C C C C C C C C C
charge: -0.208569 -0.206643 -0.018454 -0.249694 -0.097697 -0.009386 0.418992 0.112323 -0.153469 0.265714 0.087207 -0.156116 -0.139671 -0.188654 0.474818 -0.232735 0.189514 0.112521
polarizability: 2.01485607e+02 2.01193526e+01 1.52735428e+02 -1.14385567e+01 2.13158173e+01 9.97667385e+01
1716.lowfreq: 0.0002 0.0004 0.0007 0.8777 5.7900 6.7974 17.5896 32.8215 42.8022
frequency: 17.5646 32.7580 42.7148 53.9829 66.1586 91.8499 136.6855 159.7589 193.4292 224.1576 233.6764 257.6013 287.1543 299.5517 338.0336 363.8489 395.1933 449.2211 452.2345 470.4276 485.6254 531.3195 549.6552 580.4091 589.2000 600.2980 617.9428 639.4841 640.0486 716.9726 734.8673 751.1695 766.6198 774.9415 811.6003 822.1560 828.2301 878.9671 902.3592 938.2586 949.7716 954.3101 966.3883 976.9449 1056.9034 1064.3354 1101.2116 1105.9271 1134.1257 1160.2747 1170.0626 1187.9990 1245.7536 1251.9380 1267.0367 1280.6799 1285.5542 1296.9740 1314.2772 1343.6015 1356.7809 1398.3993 1407.3694 1416.3627 1462.1132 1469.1791 1506.1022 1557.0467 1580.2580 1612.0475 1638.7055 1663.7694 2985.5749 3038.9252 3058.3336 3067.2224 3126.5027 3153.7347 3156.3035 3219.1469 3470.8809 3499.3020 3607.8598 3612.1097
redmass: 11.6092 5.6157 6.5789 9.5071 5.0707 7.5083 6.0092 7.1200 4.7927 4.6985 1.5366 3.6314 2.7159 2.3124 6.0934 4.9628 4.3163 4.4279 3.8147 3.7622 7.1865 1.1923 1.4860 4.8641 3.4397 3.3080 2.1347 2.0389 4.1629 4.0404 4.2944 4.5622 3.9229 3.1587 1.5274 1.6981 4.2884 1.6256 5.5328 1.9005 1.4811 3.6044 5.2651 3.9048 3.3692 2.8161 1.6583 1.6524 1.4808 1.6261 1.6189 1.4704 2.2516 1.4056 1.6254 1.1396 1.4836 1.6581 1.2043 2.2545 1.7148 4.4727 2.0251 2.6051 1.1540 4.0615 3.6950 5.8361 6.6649 1.3893 6.8278 3.1593 1.0596 1.0961 1.0937 1.0894 1.0881 1.0944 1.0947 1.0983 1.0446 1.0638 1.0989 1.0811
irintensity: 3.0909 0.0734 0.2374 4.4476 2.0188 1.5407 2.0228 8.4601 0.2593 5.7856 51.2720 7.2411 11.3249 14.0276 7.3898 1.6791 8.9999 8.9509 3.4970 10.6478 14.8796 77.8638 256.5403 2.7900 12.7737 44.6413 113.7118 170.3786 2.8348 12.5559 59.1775 6.3653 0.3721 1.6831 52.4339 50.3174 16.3419 69.1419 93.2455 7.4596 3.5672 30.9889 10.4633 112.9926 19.3193 217.4495 32.8509 16.0419 10.3570 37.2620 45.8371 7.5754 19.4578 13.6824 5.0485 5.8897 3.0811 6.7130 3.4732 30.2638 121.2112 36.7323 17.8746 4.7010 10.2629 27.8639 28.6999 3.2070 0.3096 156.5189 6.3115 87.4336 38.8138 7.7074 22.4123 34.0360 9.1984 7.8005 1.2553 0.9321 7.9356 18.9702 7.6459 71.8894
temp: 298.150 k
press: 1.00000 atm
elementType: 9 9 8 8 7 7 6 6 6 6 6 6 6 6 6 6 6 6 1 1 1 1 1 1 1 1 1 1 1 1
symmnumber: 1
zpe: 591578.6 jmol-1
zpe.correction: 0.225320 hartree
zpe.thermalcorrener: 0.242114 hartree
zpe.thermalcorrenthalpy: 0.243059 hartree
zpe.thermalcorrgfe: 0.178535 hartree
zpe.sumelectzpe: -922.815858 hartree
zpe.sumelectthermal: -922.799064 hartree
zpe.sumelectthermalent: -922.798120 hartree
zpe.sumelectthermalfe: -922.862644 hartree
dipole: 2.7308 3.5638 -0.6257
dipole: 4.5331
quadrupole: -118.7572 -89.9623 -103.9291
quadrupole: 10.0176 -2.0361 6.6234
quadrupole: -14.5410 14.2539 0.2871 10.0176 -2.0361 6.6234
hfenergy: -923.0411783 hartree
pointgroup: C01 [X(C12H12F2N2O2)]
dipole: -1.1339522 1.3550956 0.2421413 debye
polarizability: 202.8708119|-18.3359353|150.2423187|-11.8294792|-22.3679279|100.8746427 unknown
InChI: InChI=1S/C12H12F2N2O2/c13-11(14)6-1-2-8-7(3-9(15)12(17)18)5-16-10(8)4-6/h1-2,4-5,9,11,16-17H,3,15H2
charge 0 multiplicity 1
30 atoms
F  4.995267 0.463594 0.395364
F  4.384621 -1.103313 -1.157795
O  -2.080854 -1.322836 -1.662487
O  -2.637206 -2.36446 0.336256
N  0.243701 2.565258 -0.647334
N  -4.823869 -0.524471 0.390242
C  -1.350381 1.272401 0.372423
C  -0.070922 0.586933 0.452895
C  -2.680806 0.781222 0.882158
C  0.911043 1.422656 -0.194878
C  -3.514931 -0.110386 -0.12856
C  -1.111345 2.470883 -0.304625
C  0.34792 -0.646838 1.019726
C  2.267861 1.065247 -0.291996
C  2.653605 -0.167446 0.277993
C  1.703072 -1.009911 0.93069
C  -2.72922 -1.380223 -0.434761
C  4.073883 -0.626078 0.180666
H  -3.333889 1.639292 1.133284
H  -2.553463 0.190825 1.810239
H  -3.642263 0.455931 -1.066708
H  -1.810057 3.265252 -0.562914
H  0.675033 3.343243 -1.141305
H  -0.3691 -1.308354 1.517196
H  3.010534 1.706407 -0.777238
H  2.038271 -1.958953 1.366116
H  -5.450315 0.242949 0.643198
H  -4.774321 -1.270197 1.091233
H  4.351235 -1.437441 0.875759
H  -1.521806 -2.138786 -1.785637
