program: Gaussian 09
title: 000131374
version: EM64L-G09RevD.01
frameworkgroup: C1[X(C19H17NO2S)]
method: RPBEPBE
basis: SDD
operation: Freq
keyword: #p
keyword: freq=noraman
keyword: PBEPBE/SDD
title: #p freq=noraman PBEPBE/SDD
converged: YES YES NO NO
title: Mulliken charges:
elementType: S O O N C C C C C C C C C C C C C C C C C C C H H H H H H H H H H H H H H H H H
charge: 0.225576 -0.433280 -0.262987 -0.279134 -0.217951 -0.752762 0.482546 0.534528 0.586945 -0.363849 -0.481998 -0.237870 -0.293742 -0.356461 -0.425253 -0.383719 -0.254590 -0.231136 -0.244659 -0.348940 -0.367834 0.318154 -0.537691 0.224508 0.299200 0.248660 0.257409 0.241900 0.261527 0.237370 0.287133 0.359797 0.255420 0.231752 0.231663 0.253069 0.243559 0.222997 0.222349 0.247793
chargesum: 0.00000
title: Mulliken charges with hydrogens summed into heavy atoms:
elementType: S O O N C C C C C C C C C C C C C C C C C C C
charge: 0.225576 -0.073483 -0.262987 -0.279134 0.006556 -0.453562 0.482546 0.534528 0.586945 -0.363849 -0.233338 0.019539 -0.051841 -0.094934 -0.187883 -0.096586 0.000830 0.000616 -0.012996 -0.095871 -0.124275 0.318154 0.155448
polarizability: 3.16783272e+02 2.95559004e+00 2.67082620e+02 9.63519108e+00 -1.03484754e+01 1.39245115e+02
1716.lowfreq: -0.0023 -0.0012 0.0016 1.9429 7.3764 8.6805 22.6997 41.8473 43.9979
frequency: 22.3799 41.7945 43.9758 81.5830 94.2464 106.1047 125.6428 136.9416 142.8266 175.9853 202.7212 222.5869 245.1702 249.4365 286.3569 296.0460 311.1338 341.3777 358.2220 375.7067 407.2359 420.1656 426.3511 451.2986 470.4629 500.7435 523.7755 528.4685 549.5330 594.9295 613.9556 629.9906 647.8789 669.1054 686.1852 710.1903 725.5016 726.9282 735.9964 758.8457 763.6030 780.7953 797.7447 823.3329 831.9250 852.5502 867.8006 871.6347 877.9441 895.3582 946.9734 948.9373 965.3313 981.2626 983.5431 986.8467 1001.8471 1007.4050 1025.2648 1032.1266 1056.0109 1096.1598 1111.0815 1113.4294 1120.0074 1152.7191 1157.3153 1170.5527 1179.0456 1195.0423 1210.2153 1219.2848 1232.6623 1237.8425 1241.1323 1261.4572 1298.3146 1309.0067 1316.1275 1337.8717 1370.8323 1373.1160 1379.8098 1415.3794 1417.7777 1433.8425 1437.2932 1468.2501 1473.0493 1474.9970 1485.1888 1498.8046 1558.7515 1577.0892 1582.7360 1595.4641 1618.5169 2939.7675 2961.0214 3031.8962 3049.5042 3123.5357 3127.4334 3131.9192 3138.4041 3142.0703 3154.0779 3163.3896 3168.6612 3168.8933 3202.7287 3218.6815 3243.3355 3493.5486
redmass: 5.5202 4.8942 3.7586 4.9803 4.7714 4.1277 4.8685 4.9834 6.0512 3.6478 6.0717 4.0778 1.4106 3.9225 4.6303 5.9896 7.6345 3.5762 2.3744 1.9272 7.3650 2.9599 4.1772 4.7587 3.9130 5.3997 4.4585 3.3376 3.8721 4.9774 3.1914 6.2931 6.3135 4.2706 4.5115 5.3022 1.2539 4.1463 3.6394 3.8290 1.5818 3.6371 1.5090 1.2842 1.9461 3.1811 1.3679 1.3731 5.3916 4.0250 1.3907 1.3892 1.3478 3.2390 1.3573 8.5017 2.9349 4.8817 3.7627 1.6309 1.7940 1.8117 1.3686 1.2620 1.5787 1.3921 1.3501 1.0573 1.2900 1.5603 1.5242 1.4331 2.5698 1.4177 2.0639 1.5028 1.2729 1.3020 2.7295 2.2612 2.5407 10.4092 3.7082 2.5718 3.5394 2.7733 1.1721 1.0502 1.0849 3.6646 4.2645 2.3899 5.9826 6.9452 6.9411 6.6104 6.2987 1.0838 1.0330 1.0846 1.1040 1.0896 1.0993 1.0851 1.0885 1.0897 1.0948 1.0945 1.0954 1.1009 1.0924 1.0950 1.1082 1.0653
irintensity: 0.1099 0.2441 1.5445 3.1915 0.6623 1.8238 3.8433 0.5111 4.6249 1.2595 0.3513 1.1337 1.1083 2.1115 5.8088 0.7370 2.7019 12.6197 36.6218 86.2561 1.8356 8.0465 19.1742 1.7854 13.7339 0.0259 12.0695 18.9316 0.3239 19.1490 6.5587 4.4395 7.0705 2.0537 0.5718 2.8066 102.7493 5.3145 4.0648 21.5224 38.3886 30.1212 12.3482 3.9256 44.5775 20.1615 1.2156 0.3526 5.8434 35.6165 2.4153 6.3768 0.2167 2.3436 0.0380 45.1470 13.6579 28.2876 19.6563 1.5165 27.0357 9.4515 12.5323 0.5409 1.8909 37.7111 1.6318 0.6382 87.2602 8.1652 2.4954 18.0177 193.7029 20.7420 22.9459 2.7957 10.7189 0.6599 15.4867 9.9290 39.6533 1.3376 31.0411 1.0727 1.3570 25.5294 13.8358 14.8307 69.2698 24.1658 156.1237 119.8553 1.5050 19.3209 3.3984 20.4886 72.5523 35.3330 62.8148 8.4995 46.1498 11.1721 27.7867 0.1183 3.4317 8.1857 16.7350 9.5329 10.3901 19.5780 5.0334 3.3540 2.8543 14.6856
temp: 298.150 k
press: 1.00000 atm
elementType: 16 8 8 7 6 6 6 6 6 6 6 6 6 6 6 6 6 6 6 6 6 6 6 1 1 1 1 1 1 1 1 1 1 1 1 1 1 1 1 1
symmnumber: 1
zpe: 816541.3 jmol-1
zpe.correction: 0.311004 hartree
zpe.thermalcorrener: 0.330748 hartree
zpe.thermalcorrenthalpy: 0.331692 hartree
zpe.thermalcorrgfe: 0.262334 hartree
zpe.sumelectzpe: -1335.825175 hartree
zpe.sumelectthermal: -1335.805431 hartree
zpe.sumelectthermalent: -1335.804487 hartree
zpe.sumelectthermalfe: -1335.873845 hartree
dipole: 2.3911 2.0914 -1.0222
dipole: 3.3371
quadrupole: -125.3128 -122.3256 -150.7676
quadrupole: 4.1417 -2.1149 -4.7109
quadrupole: 7.4892 10.4764 -17.9656 4.1417 -2.1149 -4.7109
hfenergy: -1336.1361792 hartree
pointgroup: C01 [X(C19H17N1O2S1)]
dipole: 0.8974918 -0.8349025 0.4703202 debye
polarizability: 316.8727517|-4.914036|265.9466297|-5.2664881|-16.8795436|140.2916261 unknown
InChI: InChI=1S/C19H17NO2S/c1-22-14-10-8-13(9-11-14)19-18(21)16-6-4-12-20(16)15-5-2-3-7-17(15)23-19/h2-12,18-19,21H,1H3
charge 0 multiplicity 1
40 atoms
S  -0.582604 -0.206445 -1.90987
O  -0.325121 0.565373 1.558471
O  5.792327 -0.163103 0.504058
N  -2.876482 0.714256 0.067275
C  -0.474468 1.525628 0.452202
C  0.327823 1.096574 -0.828998
C  -1.939209 1.754487 0.231791
C  -2.608473 -0.690802 0.051637
C  1.758098 0.7005 -0.507579
C  -1.55254 -1.229586 -0.732324
C  -2.644529 2.962922 0.230266
C  -4.159166 1.275236 -0.036923
C  -4.040462 2.66377 0.04855
C  -3.426041 -1.557283 0.815339
C  2.806643 1.647792 -0.667175
C  2.08664 -0.580678 0.00434
C  -1.334935 -2.627082 -0.739812
C  -3.215447 -2.951845 0.78597
C  -2.166674 -3.491352 0.007068
C  4.133163 1.33372 -0.321778
C  3.41397 -0.913462 0.355479
C  4.441918 0.05017 0.195277
C  6.169848 -1.478563 1.027904
H  -0.037169 2.504339 0.750659
H  0.322366 1.973213 -1.502205
H  -2.199056 3.94858 0.362208
H  -5.028791 0.643621 -0.204724
H  -4.859988 3.377077 -0.018371
H  -4.208781 -1.124721 1.446902
H  2.581582 2.641713 -1.0732
H  1.300752 -1.339233 0.08899
H  0.643773 0.374249 1.676768
H  -0.521382 -3.030651 -1.352013
H  -3.856096 -3.610166 1.382408
H  -1.991509 -4.572145 -0.015813
H  4.944126 2.057046 -0.449246
H  3.632464 -1.914608 0.739054
H  5.944023 -2.281554 0.299579
H  5.659124 -1.691844 1.987113
H  7.255782 -1.420844 1.191222
