program: Gaussian 09
title: 000131364
version: EM64L-G09RevD.01
frameworkgroup: C1[X(C18H18ClNO2)]
method: RPBEPBE
basis: SDD
operation: Freq
keyword: #p
keyword: freq=noraman
keyword: PBEPBE/SDD
title: #p freq=noraman PBEPBE/SDD
converged: YES YES NO NO
title: Mulliken charges:
elementType: Cl O O N C C C C C C C C C C C C C C C C C C H H H H H H H H H H H H H H H H H H
charge: -0.064998 -0.411650 -0.207639 -0.060804 -0.292265 -0.434767 0.312500 -0.368449 -0.580250 0.371977 0.433944 -0.472951 -0.635037 -0.478973 -0.353379 -0.418440 0.388469 -0.337703 -0.403320 -0.364873 0.379538 -0.206537 0.226571 0.225481 0.196928 0.196858 0.210062 0.218568 0.223444 0.278367 0.226790 0.193338 0.229282 0.259154 0.246111 0.242842 0.234978 0.271029 0.359762 0.166043
chargesum: 0.00000
title: Mulliken charges with hydrogens summed into heavy atoms:
elementType: Cl O O N C C C C C C C C C C C C C C C C C C
charge: -0.064998 -0.051889 -0.207639 -0.060804 -0.065694 -0.012358 0.312500 0.038471 -0.138239 0.371977 0.433944 -0.194584 0.014372 -0.219819 -0.107268 -0.175598 0.388469 -0.337703 -0.168342 -0.093843 0.379538 -0.040494
polarizability: 2.94044282e+02 -2.15109280e+01 2.26680909e+02 -4.36266656e+00 9.19672605e+00 1.55135696e+02
1716.lowfreq: -10.9461 -7.8246 -5.1790 -0.0010 0.0014 0.0016 21.0646 38.0167 49.6703
frequency: 21.0059 38.0131 49.6502 55.3155 86.5529 107.3704 136.2936 149.8337 165.5974 188.3672 193.2469 202.4552 224.2604 232.4479 251.5753 283.5262 290.1217 319.7966 340.8069 350.6955 384.9315 400.5686 411.4986 439.2415 445.5250 448.7213 466.1130 492.1543 523.7061 532.7542 566.9980 609.6570 626.7219 646.3925 659.4414 710.7274 730.3360 741.7737 756.6257 782.1887 810.3706 844.2848 859.5687 866.0788 866.7256 892.7603 916.9429 943.0381 963.3191 975.1790 989.8893 1002.8548 1004.6214 1010.1797 1022.5754 1043.0470 1069.6450 1107.5076 1112.9559 1117.6492 1130.5883 1173.1946 1181.4225 1183.1337 1188.1231 1198.6486 1215.3772 1221.1830 1232.3633 1254.8354 1269.0867 1283.1089 1296.1844 1309.1631 1314.9917 1331.1913 1351.6146 1368.6610 1374.0691 1387.8075 1402.0293 1415.7496 1417.9324 1432.7867 1456.9525 1461.4348 1464.9958 1474.4454 1482.7075 1484.7615 1499.4426 1566.6607 1578.2572 1607.3783 1616.0210 1624.8394 2848.0749 2853.1281 2865.4508 2874.7664 2976.4176 2979.6110 3020.2640 3021.9216 3033.3881 3044.8808 3079.9931 3116.8295 3128.5070 3145.6870 3152.0567 3156.2697 3171.2259 3505.9630
redmass: 6.2207 5.6278 4.1839 5.9091 4.0446 7.4937 3.5636 3.3989 4.5337 5.0303 4.8799 4.5728 1.2999 3.9028 4.4950 4.4666 4.7682 2.9986 2.3230 2.6643 4.0663 5.0665 3.0697 1.7823 3.3767 1.5229 4.9076 5.0595 3.6242 3.2235 2.5265 4.9013 6.7428 5.7380 5.5525 5.8669 3.5234 3.7156 3.2486 2.9604 4.2171 1.6714 1.7954 1.4100 2.1011 1.4687 2.6361 2.6066 1.4498 2.5254 1.4723 2.0514 1.9562 2.9127 2.3847 2.4159 2.2906 1.6448 2.1383 1.4353 2.4071 1.2362 1.2625 1.4991 1.5215 1.6745 1.5367 2.9354 1.6842 1.4037 2.4897 2.0751 1.4895 1.3842 1.3860 1.6065 1.3794 1.7971 1.4622 3.0875 2.9420 2.4314 3.3637 1.1632 1.0770 1.1192 1.0559 1.2289 2.6351 1.0655 2.6052 7.4291 7.3635 6.1931 7.2841 6.8488 1.0714 1.0668 1.0848 1.0580 1.0791 1.0646 1.0889 1.0744 1.0894 1.0979 1.1008 1.0880 1.0887 1.0953 1.0920 1.0961 1.0909 1.0649
irintensity: 0.7820 0.1164 0.2518 0.0418 0.3903 4.9156 1.2471 2.2253 4.2532 2.5640 7.4236 1.5102 0.9639 1.1789 4.6468 0.5582 5.6947 3.3300 2.3791 4.2576 4.2775 0.9679 0.4733 81.6266 2.0475 61.1445 3.6337 10.2139 8.1109 31.1974 4.7252 4.8107 1.7840 6.6602 2.4645 27.1717 2.1774 23.8712 4.6649 4.6132 47.3142 47.8587 0.2804 7.6803 19.9614 14.0721 1.4687 22.1534 3.0517 7.3827 1.1434 9.9019 21.4064 1.3144 5.7831 19.1594 26.4502 9.9980 61.1841 6.6745 28.1433 23.7148 66.4283 103.0579 20.0854 23.6680 5.3077 64.7970 7.6919 5.4844 15.8754 41.9374 9.1730 4.6171 6.9196 4.5238 1.0866 3.2091 29.9262 6.7223 10.6093 28.6531 5.3893 4.4021 0.3963 16.1095 27.3077 17.9688 108.0145 11.8025 2.5722 107.0642 26.3098 274.6826 37.1706 36.4246 43.3766 55.6118 130.6961 203.7625 22.0713 10.5523 38.0064 55.6434 40.3307 32.2511 34.8236 10.8935 6.8627 15.2436 2.8501 3.9914 1.7479 63.7673
temp: 298.150 k
press: 1.00000 atm
elementType: 17 8 8 7 6 6 6 6 6 6 6 6 6 6 6 6 6 6 6 6 6 6 1 1 1 1 1 1 1 1 1 1 1 1 1 1 1 1 1 1
symmnumber: 1
zpe: 829656.8 jmol-1
zpe.correction: 0.316000 hartree
zpe.thermalcorrener: 0.335967 hartree
zpe.thermalcorrenthalpy: 0.336911 hartree
zpe.thermalcorrgfe: 0.266570 hartree
zpe.sumelectzpe: -1360.366756 hartree
zpe.sumelectthermal: -1360.346788 hartree
zpe.sumelectthermalent: -1360.345844 hartree
zpe.sumelectthermalfe: -1360.416185 hartree
dipole: -3.7474 3.8035 -1.8712
dipole: 5.6578
quadrupole: -161.3852 -133.5841 -131.5051
quadrupole: 5.7159 -12.1017 1.7388
quadrupole: -19.2270 8.5740 10.6530 5.7159 -12.1017 1.7388
hfenergy: -1360.6827554 hartree
pointgroup: C01 [X(C18H18Cl1N1O2)]
dipole: 1.6656586 1.2946703 0.7101709 debye
polarizability: 298.8284743|11.0830601|221.3838425|-4.7038034|-10.4967529|155.6485697 unknown
InChI: InChI=1S/C18H18ClNO2/c1-20-7-6-14-8-17(19)18(22)9-15(14)16(10-20)13-4-2-12(11-21)3-5-13/h2-5,8-9,11,16,22H,6-7,10H2,1H3
charge 0 multiplicity 1
40 atoms
Cl 4.32726 -3.495734 0.264635
O  1.320424 -3.655483 0.931521
O  -6.196197 -1.080621 -0.668216
N  1.409993 3.181839 0.023763
C  0.123678 1.015234 -0.328593
C  0.441398 2.229721 0.61145
C  1.160513 -0.114195 -0.183483
C  2.799416 2.674598 -0.072471
C  2.965174 1.500018 -1.070608
C  2.520125 0.143757 -0.546028
C  -1.316339 0.540534 -0.154006
C  0.799689 -1.390281 0.299895
C  1.356348 4.498529 0.696482
C  3.475421 -0.890716 -0.406728
C  -1.904382 0.395374 1.131854
C  -2.102556 0.230275 -1.297997
C  1.75435 -2.42254 0.443341
C  3.091413 -2.148712 0.082487
C  -3.237855 -0.037378 1.268319
C  -3.433937 -0.203549 -1.169428
C  -4.015258 -0.340479 0.119986
C  -5.417855 -0.79422 0.281414
H  0.216934 1.426145 -1.355138
H  -0.497754 2.790598 0.770076
H  0.77676 1.851072 1.610788
H  3.202625 2.366215 0.926434
H  3.422156 3.516639 -0.429539
H  4.033886 1.440073 -1.347321
H  2.410176 1.772854 -1.990633
H  -0.232593 -1.626558 0.569903
H  2.016372 5.210061 0.168815
H  1.672211 4.467129 1.76909
H  0.32618 4.894845 0.655793
H  4.519596 -0.712842 -0.682575
H  -1.314294 0.619678 2.027389
H  -1.656826 0.335135 -2.294232
H  -3.682191 -0.146073 2.266068
H  -4.046287 -0.441206 -2.046311
H  2.082711 -4.291964 0.975429
H  -5.763586 -0.872172 1.344474
